BDBM50237743 CHEMBL4102205
SMILES: NC(=O)c1ccc(NC(=O)[C@@H]2NC3(CCCCC3)[C@]3([C@H]2c2cccc(Cl)c2F)C(=O)Nc2cc(Cl)ccc32)cc1
InChI Key: InChIKey=GUDSBGCNSIMLIH-LOLKONATSA-N
Data: 1 KI  1 IC50
Activity Spreadsheet -- Enzyme Inhibition Constant Data from BindingDB
Found 2 hits for monomerid = 50237743
Trg + Lig
Ki
nM
ΔG°
kcal/mole
IC50
nM
Kd
nM
EC50/IC50
nM
koff
s-1
kon
M-1s-1
pHTemp
°C
MDM2-MDMX
(Homo sapiens (Human))
BDBM50237743
(CHEMBL4102205)
Show SMILES NC(=O)c1ccc(NC(=O)[C@@H]2NC3(CCCCC3)[C@]3([C@H]2c2cccc(Cl)c2F)C(=O)Nc2cc(Cl)ccc32)cc1 |r|
Show InChI InChI=1S/C30H27Cl2FN4O3/c31-17-9-12-20-22(15-17)36-28(40)30(20)23(19-5-4-6-21(32)24(19)33)25(37-29(30)13-2-1-3-14-29)27(39)35-18-10-7-16(8-11-18)26(34)38/h4-12,15,23,25,37H,1-3,13-14H2,(H2,34,38)(H,35,39)(H,36,40)/t23-,25+,30+/m0/s1
NCI pathway
Reactome pathway
1.90n/an/an/an/an/an/an/an/a
University of Michigan Comprehensive Cancer Center
Curated by ChEMBL
Assay Description
Binding affinity measured by inhibition of 3[H] AVP binding to cloned human vasopressin V2 receptor
J Med Chem 60: 2819-2839 (2017)
Article DOI: 10.1021/acs.jmedchem.6b01665
BindingDB Entry DOI: 10.7270/Q25Q4ZCF
MDM2-MDMX
(Homo sapiens (Human))
BDBM50237743
(CHEMBL4102205)
Show SMILES NC(=O)c1ccc(NC(=O)[C@@H]2NC3(CCCCC3)[C@]3([C@H]2c2cccc(Cl)c2F)C(=O)Nc2cc(Cl)ccc32)cc1 |r|
Show InChI InChI=1S/C30H27Cl2FN4O3/c31-17-9-12-20-22(15-17)36-28(40)30(20)23(19-5-4-6-21(32)24(19)33)25(37-29(30)13-2-1-3-14-29)27(39)35-18-10-7-16(8-11-18)26(34)38/h4-12,15,23,25,37H,1-3,13-14H2,(H2,34,38)(H,35,39)(H,36,40)/t23-,25+,30+/m0/s1
NCI pathway
Reactome pathway
n/an/a 12n/an/an/an/an/an/a
University of Michigan Comprehensive Cancer Center
Curated by ChEMBL
Assay Description
Inhibition of FAM-tagged p53-based PMDM6-F peptide binding to human recombinant His-tagged MDM2 (1 to 118 residues) after 30 mins by fluorescence pol...
J Med Chem 60: 2819-2839 (2017)
Article DOI: 10.1021/acs.jmedchem.6b01665
BindingDB Entry DOI: 10.7270/Q25Q4ZCF