BDBM50238000 CHEMBL4061977
SMILES: OC(=O)CCn1c2cc(Cl)ccc2oc1=O
InChI Key: InChIKey=ODWSXTKSQNMMMQ-UHFFFAOYSA-N
Data: 2 IC50
Activity Spreadsheet -- Enzyme Inhibition Constant Data from BindingDB
Found 2 hits for monomerid = 50238000
Trg + Lig
Ki
nM
ΔG°
kcal/mole
IC50
nM
Kd
nM
EC50/IC50
nM
koff
s-1
kon
M-1s-1
pHTemp
°C
Kynurenine 3-monooxygenase
(Homo sapiens (Human))
BDBM50238000
(CHEMBL4061977)
Show SMILES OC(=O)CCn1c2cc(Cl)ccc2oc1=O
Show InChI InChI=1S/C10H8ClNO4/c11-6-1-2-8-7(5-6)12(10(15)16-8)4-3-9(13)14/h1-2,5H,3-4H2,(H,13,14)
Reactome pathway
n/an/a 13n/an/an/an/an/an/a
GlaxoSmithKline
Curated by ChEMBL
Assay Description
Displacement of from norepinephrine transporter of frozen rat caudate membranes
Bioorg Med Chem Lett 27: 2023-2028 (2017)
Article DOI: 10.1016/j.bmcl.2017.02.078
BindingDB Entry DOI: 10.7270/Q23R0W54
Kynurenine 3-monooxygenase
(Homo sapiens (Human))
BDBM50238000
(CHEMBL4061977)
Show SMILES OC(=O)CCn1c2cc(Cl)ccc2oc1=O
Show InChI InChI=1S/C10H8ClNO4/c11-6-1-2-8-7(5-6)12(10(15)16-8)4-3-9(13)14/h1-2,5H,3-4H2,(H,13,14)
Reactome pathway
n/an/a 3.98E+3n/an/an/an/an/an/a
GlaxoSmithKline
Curated by ChEMBL
Assay Description
Compound was tested for binding affinity towards Opioid receptor mu 1 by displacing [3H]DAGO radioligand in rat brain P2 synaptosomes membranes.
Bioorg Med Chem Lett 27: 2023-2028 (2017)
Article DOI: 10.1016/j.bmcl.2017.02.078
BindingDB Entry DOI: 10.7270/Q23R0W54