BDBM50238017 CHEMBL4083400
SMILES: OC(=O)CCn1ncc2cc(Cl)ccc12
InChI Key: InChIKey=LTTLDHFBRZXZKV-UHFFFAOYSA-N
Data: 1 IC50
Activity Spreadsheet -- Enzyme Inhibition Constant Data from BindingDB
Found 1 hit for monomerid = 50238017
Trg + Lig
Ki
nM
ΔG°
kcal/mole
IC50
nM
Kd
nM
EC50/IC50
nM
koff
s-1
kon
M-1s-1
pHTemp
°C
Kynurenine 3-monooxygenase
(Homo sapiens (Human))
BDBM50238017
(CHEMBL4083400)
Show SMILES OC(=O)CCn1ncc2cc(Cl)ccc12
Show InChI InChI=1S/C10H9ClN2O2/c11-8-1-2-9-7(5-8)6-12-13(9)4-3-10(14)15/h1-2,5-6H,3-4H2,(H,14,15)
Reactome pathway
n/an/a 1.00E+3n/an/an/an/an/an/a
GlaxoSmithKline
Curated by ChEMBL
Assay Description
Inhibition of recombinant full-length human N-terminal GST tagged KMO expressed in baculovirus infected Sf9 insect cell membranes using L-kynurenine ...
Bioorg Med Chem Lett 27: 2023-2028 (2017)
Article DOI: 10.1016/j.bmcl.2017.02.078
BindingDB Entry DOI: 10.7270/Q23R0W54