BDBM50238093 CHEMBL4094958
SMILES: COc1cccc2nccc(Nc3cc(ncc3C)-c3nc(C)ccc3F)c12
InChI Key: InChIKey=JZIQEQUBVSUUPN-UHFFFAOYSA-N
Data: 3 IC50  1 EC50
Activity Spreadsheet -- Enzyme Inhibition Constant Data from BindingDB
Found 4 hits for monomerid = 50238093
Trg + Lig
Ki
nM
ΔG°
kcal/mole
IC50
nM
Kd
nM
EC50/IC50
nM
koff
s-1
kon
M-1s-1
pHTemp
°C
TGF-beta receptor type-1
(Homo sapiens (Human))
BDBM50238093
(CHEMBL4094958)
Show SMILES COc1cccc2nccc(Nc3cc(ncc3C)-c3nc(C)ccc3F)c12
Show InChI InChI=1S/C22H19FN4O/c1-13-12-25-19(22-15(23)8-7-14(2)26-22)11-18(13)27-17-9-10-24-16-5-4-6-20(28-3)21(16)17/h4-12H,1-3H3,(H,24,25,27)
n/an/a 2.5n/an/an/an/an/an/a
Takeda California
Curated by ChEMBL
Assay Description
Inhibition of recombinant N-terminal GST tagged human ALK5 (200 to 503 residues) expressed in baculovirus expression system using FAM-NH2-KVLTQMGSPSI...
Bioorg Med Chem Lett 27: 1955-1961 (2017)
Article DOI: 10.1016/j.bmcl.2017.03.026
BindingDB Entry DOI: 10.7270/Q2QJ7KKZ
TGF-beta receptor type-1
(Homo sapiens (Human))
BDBM50238093
(CHEMBL4094958)
Show SMILES COc1cccc2nccc(Nc3cc(ncc3C)-c3nc(C)ccc3F)c12
Show InChI InChI=1S/C22H19FN4O/c1-13-12-25-19(22-15(23)8-7-14(2)26-22)11-18(13)27-17-9-10-24-16-5-4-6-20(28-3)21(16)17/h4-12H,1-3H3,(H,24,25,27)
n/an/an/an/a 32n/an/an/an/a
Takeda California
Curated by ChEMBL
Assay Description
Inhibition of ALK5 in human Calu6 cells assessed as reduction in Smad2/3 phosphorylation
Bioorg Med Chem Lett 27: 1955-1961 (2017)
Article DOI: 10.1016/j.bmcl.2017.03.026
BindingDB Entry DOI: 10.7270/Q2QJ7KKZ
Cytochrome P450 3A4
(Homo sapiens (Human))
BDBM50238093
(CHEMBL4094958)
Show SMILES COc1cccc2nccc(Nc3cc(ncc3C)-c3nc(C)ccc3F)c12
Show InChI InChI=1S/C22H19FN4O/c1-13-12-25-19(22-15(23)8-7-14(2)26-22)11-18(13)27-17-9-10-24-16-5-4-6-20(28-3)21(16)17/h4-12H,1-3H3,(H,24,25,27)
Reactome pathway
n/an/a 6.31E+3n/an/an/an/an/an/a
Takeda California
Curated by ChEMBL
Assay Description
Inhibition of CYP3A4 (unknown origin)
Bioorg Med Chem Lett 27: 1955-1961 (2017)
Article DOI: 10.1016/j.bmcl.2017.03.026
BindingDB Entry DOI: 10.7270/Q2QJ7KKZ
Cytochrome P450 2C8
(Homo sapiens (Human))
BDBM50238093
(CHEMBL4094958)
Show SMILES COc1cccc2nccc(Nc3cc(ncc3C)-c3nc(C)ccc3F)c12
Show InChI InChI=1S/C22H19FN4O/c1-13-12-25-19(22-15(23)8-7-14(2)26-22)11-18(13)27-17-9-10-24-16-5-4-6-20(28-3)21(16)17/h4-12H,1-3H3,(H,24,25,27)
n/an/a 2.51E+3n/an/an/an/an/an/a
Takeda California
Curated by ChEMBL
Assay Description
Inhibition of CYP2C8 (unknown origin)
Bioorg Med Chem Lett 27: 1955-1961 (2017)
Article DOI: 10.1016/j.bmcl.2017.03.026
BindingDB Entry DOI: 10.7270/Q2QJ7KKZ