BDBM50238228 CHEMBL4092048
SMILES: [Br-].COc1cc2CC(Cc3cc[n+](Cc4cccc(Cl)c4)cc3C(N)=O)C(=O)c2cc1OC
InChI Key: InChIKey=FIWPFDRVIPYHQB-UHFFFAOYSA-N
Data: 2 IC50
Activity Spreadsheet -- Enzyme Inhibition Constant Data from BindingDB
Found 2 hits for monomerid = 50238228
Trg + Lig
Ki
nM
ΔG°
kcal/mole
IC50
nM
Kd
nM
EC50/IC50
nM
koff
s-1
kon
M-1s-1
pHTemp
°C
Cholinesterase
(Equus caballus (Horse))
BDBM50238228
(CHEMBL4092048)
Show SMILES [Br-].COc1cc2CC(Cc3cc[n+](Cc4cccc(Cl)c4)cc3C(N)=O)C(=O)c2cc1OC
Show InChI InChI=1S/C25H23ClN2O4.BrH/c1-31-22-11-17-10-18(24(29)20(17)12-23(22)32-2)9-16-6-7-28(14-21(16)25(27)30)13-15-4-3-5-19(26)8-15;/h3-8,11-12,14,18H,9-10,13H2,1-2H3,(H-,27,30);1H
n/an/a>1.00E+4n/an/an/an/an/an/a
VFP Therapies
Curated by ChEMBL
Assay Description
Inhibition of equine serum BChE using butyrylthiocholine iodide as substrate preincubated for 5 mins followed by substrate addition measured every mi...
J Med Chem 60: 5909-5926 (2017)
Article DOI: 10.1021/acs.jmedchem.7b00702
BindingDB Entry DOI: 10.7270/Q22V2JC5
Acetylcholinesterase
(Homo sapiens (Human))
BDBM50238228
(CHEMBL4092048)
Show SMILES [Br-].COc1cc2CC(Cc3cc[n+](Cc4cccc(Cl)c4)cc3C(N)=O)C(=O)c2cc1OC
Show InChI InChI=1S/C25H23ClN2O4.BrH/c1-31-22-11-17-10-18(24(29)20(17)12-23(22)32-2)9-16-6-7-28(14-21(16)25(27)30)13-15-4-3-5-19(26)8-15;/h3-8,11-12,14,18H,9-10,13H2,1-2H3,(H-,27,30);1H
NCI pathway
Reactome pathway
n/an/a 41n/an/an/an/an/an/a
VFP Therapies
Curated by ChEMBL
Assay Description
Inhibition of AChE in human erythrocytes using acetylthiocholine iodide as substrate preincubated for 5 mins followed by substrate addition measured ...
J Med Chem 60: 5909-5926 (2017)
Article DOI: 10.1021/acs.jmedchem.7b00702
BindingDB Entry DOI: 10.7270/Q22V2JC5