BDBM50238406 CHEMBL4082584
SMILES: Oc1ccc(cc1)-n1nc2n(cc([nH]c2=O)-c2ccccc2)c1=O
InChI Key: InChIKey=KXUTUXRBHLNIBK-UHFFFAOYSA-N
Data: 3 KI  1 IC50
Activity Spreadsheet -- Enzyme Inhibition Constant Data from BindingDB
Found 4 hits for monomerid = 50238406
Trg + Lig
Ki
nM
ΔG°
kcal/mole
IC50
nM
Kd
nM
EC50/IC50
nM
koff
s-1
kon
M-1s-1
pHTemp
°C
Adenosine receptor A3
(Homo sapiens (Human))
BDBM50238406
(CHEMBL4082584)
Show SMILES Oc1ccc(cc1)-n1nc2n(cc([nH]c2=O)-c2ccccc2)c1=O
Show InChI InChI=1S/C17H12N4O3/c22-13-8-6-12(7-9-13)21-17(24)20-10-14(11-4-2-1-3-5-11)18-16(23)15(20)19-21/h1-10,22H,(H,18,23)
Reactome pathway
0.370n/an/an/an/an/an/an/an/a
Universit£ degli Studi di Firenze
Curated by ChEMBL
Assay Description
Displacement of [3H]HEMADO from human adenosine receptor A3 expressed in CHO cell membranes after 3 hrs by microbeta scintillation counting method
J Med Chem 60: 5772-5790 (2017)
Article DOI: 10.1021/acs.jmedchem.7b00457
BindingDB Entry DOI: 10.7270/Q21V5H87
Adenosine receptor A1
(Homo sapiens (Human))
BDBM50238406
(CHEMBL4082584)
Show SMILES Oc1ccc(cc1)-n1nc2n(cc([nH]c2=O)-c2ccccc2)c1=O
Show InChI InChI=1S/C17H12N4O3/c22-13-8-6-12(7-9-13)21-17(24)20-10-14(11-4-2-1-3-5-11)18-16(23)15(20)19-21/h1-10,22H,(H,18,23)
Reactome pathway
129n/an/an/an/an/an/an/an/a
Universit£ degli Studi di Firenze
Curated by ChEMBL
Assay Description
Displacement of [3H]CCPA from human adenosine receptor A1 expressed in CHO cell membranes after 3 hrs by microbeta scintillation counting method
J Med Chem 60: 5772-5790 (2017)
Article DOI: 10.1021/acs.jmedchem.7b00457
BindingDB Entry DOI: 10.7270/Q21V5H87
Adenosine receptor A2a
(Homo sapiens (Human))
BDBM50238406
(CHEMBL4082584)
Show SMILES Oc1ccc(cc1)-n1nc2n(cc([nH]c2=O)-c2ccccc2)c1=O
Show InChI InChI=1S/C17H12N4O3/c22-13-8-6-12(7-9-13)21-17(24)20-10-14(11-4-2-1-3-5-11)18-16(23)15(20)19-21/h1-10,22H,(H,18,23)
NCI pathway
Reactome pathway
387n/an/an/an/an/an/an/an/a
Universit£ degli Studi di Firenze
Curated by ChEMBL
Assay Description
Displacement of [3H]NECA from human adenosine receptor A2A expressed in CHO cell membranes after 3 hrs by microbeta scintillation counting method
J Med Chem 60: 5772-5790 (2017)
Article DOI: 10.1021/acs.jmedchem.7b00457
BindingDB Entry DOI: 10.7270/Q21V5H87
Adenosine receptor A2b
(Homo sapiens (Human))
BDBM50238406
(CHEMBL4082584)
Show SMILES Oc1ccc(cc1)-n1nc2n(cc([nH]c2=O)-c2ccccc2)c1=O
Show InChI InChI=1S/C17H12N4O3/c22-13-8-6-12(7-9-13)21-17(24)20-10-14(11-4-2-1-3-5-11)18-16(23)15(20)19-21/h1-10,22H,(H,18,23)
NCI pathway
Reactome pathway
n/an/a>3.00E+4n/an/an/an/an/an/a
Universit£ degli Studi di Firenze
Curated by ChEMBL
Assay Description
Inhibition of 5-HT uptake in synaptosomal preparation from rat corpus striatum, using [3H]5-HT
J Med Chem 60: 5772-5790 (2017)
Article DOI: 10.1021/acs.jmedchem.7b00457
BindingDB Entry DOI: 10.7270/Q21V5H87