BDBM50238743 CHEMBL4070669
SMILES: CN(C)CCNC(=O)\C=C\c1ccc(cc1)C(=C1C2CC3CC(C2)CC1C3)c1ccc(O)cc1
InChI Key: InChIKey=KWSQUSLBBQBSKE-CKKFNOSNSA-N
Data: 1 KI  1 IC50
Activity Spreadsheet -- Enzyme Inhibition Constant Data from BindingDB
Found 2 hits for monomerid = 50238743
Trg + Lig
Ki
nM
ΔG°
kcal/mole
IC50
nM
Kd
nM
EC50/IC50
nM
koff
s-1
kon
M-1s-1
pHTemp
°C
Estrogen receptor
(Homo sapiens (Human))
BDBM50238743
(CHEMBL4070669)
Show SMILES CN(C)CCNC(=O)\C=C\c1ccc(cc1)C(=C1C2CC3CC(C2)CC1C3)c1ccc(O)cc1 |TLB:16:17:19:23.21.22,THB:21:20:17:23.22.24,21:22:19.20.26:17,24:22:19:26.25.17,24:25:19:23.21.22,(51.58,-12.21,;51.58,-10.67,;50.25,-9.9,;52.92,-9.91,;54.25,-10.68,;55.59,-9.92,;56.92,-10.69,;56.91,-12.23,;58.26,-9.93,;59.59,-10.7,;60.93,-9.93,;60.93,-8.38,;62.26,-7.61,;63.59,-8.38,;63.6,-9.93,;62.26,-10.7,;64.92,-7.6,;66.26,-8.37,;66.27,-9.86,;65.07,-11.13,;66.57,-10.72,;67.98,-11.27,;68.98,-10,;67.59,-10.34,;69,-8.47,;67.6,-7.9,;66.56,-9.12,;64.92,-6.06,;66.25,-5.3,;66.25,-3.76,;64.91,-2.99,;64.9,-1.45,;63.57,-3.77,;63.59,-5.31,)|
Show InChI InChI=1S/C30H36N2O2/c1-32(2)14-13-31-28(34)12-5-20-3-6-23(7-4-20)29(24-8-10-27(33)11-9-24)30-25-16-21-15-22(18-25)19-26(30)17-21/h3-12,21-22,25-26,33H,13-19H2,1-2H3,(H,31,34)/b12-5+,30-29-
0.350n/an/an/an/an/an/an/an/a
The Scripps Research Institute
Curated by ChEMBL
Assay Description
Displacement of [3H]estradiol from full-length human ERalpha receptor by scintillation counting
J Med Chem 60: 6321-6336 (2017)
Article DOI: 10.1021/acs.jmedchem.7b00585
BindingDB Entry DOI: 10.7270/Q2RB76V7
Estrogen receptor
(Homo sapiens (Human))
BDBM50238743
(CHEMBL4070669)
Show SMILES CN(C)CCNC(=O)\C=C\c1ccc(cc1)C(=C1C2CC3CC(C2)CC1C3)c1ccc(O)cc1 |TLB:16:17:19:23.21.22,THB:21:20:17:23.22.24,21:22:19.20.26:17,24:22:19:26.25.17,24:25:19:23.21.22,(51.58,-12.21,;51.58,-10.67,;50.25,-9.9,;52.92,-9.91,;54.25,-10.68,;55.59,-9.92,;56.92,-10.69,;56.91,-12.23,;58.26,-9.93,;59.59,-10.7,;60.93,-9.93,;60.93,-8.38,;62.26,-7.61,;63.59,-8.38,;63.6,-9.93,;62.26,-10.7,;64.92,-7.6,;66.26,-8.37,;66.27,-9.86,;65.07,-11.13,;66.57,-10.72,;67.98,-11.27,;68.98,-10,;67.59,-10.34,;69,-8.47,;67.6,-7.9,;66.56,-9.12,;64.92,-6.06,;66.25,-5.3,;66.25,-3.76,;64.91,-2.99,;64.9,-1.45,;63.57,-3.77,;63.59,-5.31,)|
Show InChI InChI=1S/C30H36N2O2/c1-32(2)14-13-31-28(34)12-5-20-3-6-23(7-4-20)29(24-8-10-27(33)11-9-24)30-25-16-21-15-22(18-25)19-26(30)17-21/h3-12,21-22,25-26,33H,13-19H2,1-2H3,(H,31,34)/b12-5+,30-29-
n/an/a 2.90n/an/an/an/an/an/a
The Scripps Research Institute
Curated by ChEMBL
Assay Description
Downregulation of human ERalpha in human MCF-7 cells after 24 hrs by in-cell Western immunoassay method
J Med Chem 60: 6321-6336 (2017)
Article DOI: 10.1021/acs.jmedchem.7b00585
BindingDB Entry DOI: 10.7270/Q2RB76V7