BDBM50238884 CHEMBL4060440
SMILES: C[C@@H](c1ccc(F)cc1)n1nnc2cnc3ccc(cc3c12)-c1ccnc(C)c1
InChI Key: InChIKey=DBFPRZJVPTXHSY-HNNXBMFYSA-N
Data: 2 IC50
Activity Spreadsheet -- Enzyme Inhibition Constant Data from BindingDB
Found 2 hits for monomerid = 50238884
Trg + Lig
Ki
nM
ΔG°
kcal/mole
IC50
nM
Kd
nM
EC50/IC50
nM
koff
s-1
kon
M-1s-1
pHTemp
°C
Dual specificity protein kinase CLK1/CLK4
(Homo sapiens (Human))
BDBM50238884
(CHEMBL4060440)
Show SMILES C[C@@H](c1ccc(F)cc1)n1nnc2cnc3ccc(cc3c12)-c1ccnc(C)c1 |r|
Show InChI InChI=1S/C23H18FN5/c1-14-11-18(9-10-25-14)17-5-8-21-20(12-17)23-22(13-26-21)27-28-29(23)15(2)16-3-6-19(24)7-4-16/h3-13,15H,1-2H3/t15-/m0/s1
n/an/a 29n/an/an/an/an/an/a
Sichuan University and Collaborative Innovation Center for Biotherapy
Curated by ChEMBL
Assay Description
Inhibition of recombinant human CLK1 expressed in insect cells using ERMRPRKRQGSVRRRV peptide as substrate after 40 mins in presence of [gamma-33P]-A...
J Med Chem 60: 6337-6352 (2017)
Article DOI: 10.1021/acs.jmedchem.7b00665
BindingDB Entry DOI: 10.7270/Q2ZW1P55
Dual-specificity tyrosine-phosphorylation regulated kinase 1A
(Homo sapiens (Human))
BDBM50238884
(CHEMBL4060440)
Show SMILES C[C@@H](c1ccc(F)cc1)n1nnc2cnc3ccc(cc3c12)-c1ccnc(C)c1 |r|
Show InChI InChI=1S/C23H18FN5/c1-14-11-18(9-10-25-14)17-5-8-21-20(12-17)23-22(13-26-21)27-28-29(23)15(2)16-3-6-19(24)7-4-16/h3-13,15H,1-2H3/t15-/m0/s1
Reactome pathway
n/an/a 1.30E+3n/an/an/an/an/an/a
Sichuan University and Collaborative Innovation Center for Biotherapy
Curated by ChEMBL
Assay Description
Inhibition of recombinant human DYRK1A expressed in insect cells using RRRFRPASPLRGPPK peptide as substrate after 40 mins in presence of [gamma-33P]-...
J Med Chem 60: 6337-6352 (2017)
Article DOI: 10.1021/acs.jmedchem.7b00665
BindingDB Entry DOI: 10.7270/Q2ZW1P55