BDBM50238976 CHEMBL4099509
SMILES: Cc1cc(C)c2n(CCCN3CCOCC3)c3ccccc3c(=O)c2c1
InChI Key: InChIKey=GZCNJGKYZLDAFN-UHFFFAOYSA-N
Data: 1 IC50
Activity Spreadsheet -- Enzyme Inhibition Constant Data from BindingDB
Found 1 hit for monomerid = 50238976
Trg + Lig
Ki
nM
ΔG°
kcal/mole
IC50
nM
Kd
nM
EC50/IC50
nM
koff
s-1
kon
M-1s-1
pHTemp
°C
Multidrug resistance protein 1/Multidrug resistance associated protein 1
(Homo sapiens (Human))
BDBM50238976
(CHEMBL4099509)
Show SMILES Cc1cc(C)c2n(CCCN3CCOCC3)c3ccccc3c(=O)c2c1
Show InChI InChI=1S/C22H26N2O2/c1-16-14-17(2)21-19(15-16)22(25)18-6-3-4-7-20(18)24(21)9-5-8-23-10-12-26-13-11-23/h3-4,6-7,14-15H,5,8-13H2,1-2H3
n/an/a 20n/an/an/an/an/an/a
SVKM's Dr. Bhanuben Nanavati College of Pharmacy
Curated by ChEMBL
Assay Description
Inhibition of ABCB1 in human MCF7/ADR cells assessed as potentiation of vinblastine-induced cytotoxicity by measuring vinblastine IC50 at IC10 after ...
Eur J Med Chem 130: 154-170 (2017)
Article DOI: 10.1016/j.ejmech.2017.02.022
BindingDB Entry DOI: 10.7270/Q26D5W99