BDBM50239516 CHEMBL4060634
SMILES: Cc1c(Cl)cccc1S(=O)(=O)N1CCN(CC1)c1ccc(nn1)C(=O)NCC#C
InChI Key: InChIKey=XIMLQNQQIZIERN-UHFFFAOYSA-N
Data: 1 IC50
Activity Spreadsheet -- Enzyme Inhibition Constant Data from BindingDB
Found 1 hit for monomerid = 50239516
Trg + Lig
Ki
nM
ΔG°
kcal/mole
IC50
nM
Kd
nM
EC50/IC50
nM
koff
s-1
kon
M-1s-1
pHTemp
°C
dCTP pyrophosphatase 1
(Homo sapiens (Human))
BDBM50239516
(CHEMBL4060634)
Show SMILES Cc1c(Cl)cccc1S(=O)(=O)N1CCN(CC1)c1ccc(nn1)C(=O)NCC#C
Show InChI InChI=1S/C19H20ClN5O3S/c1-3-9-21-19(26)16-7-8-18(23-22-16)24-10-12-25(13-11-24)29(27,28)17-6-4-5-15(20)14(17)2/h1,4-8H,9-13H2,2H3,(H,21,26)
n/an/a 34n/an/an/an/an/an/a
Karolinska Institutet
Curated by ChEMBL
Assay Description
Inhibition of human full length N-terminal His-tagged dCTPase expressed in Escherichia coli BL21(DE3) using dCTP as substrate by HTS-based malachite ...
J Med Chem 60: 4279-4292 (2017)
Article DOI: 10.1021/acs.jmedchem.7b00182
BindingDB Entry DOI: 10.7270/Q22N54F5