BDBM50239658 CHEMBL4100679
SMILES: CC(C)C1(c2c(C)[nH]nc2OC(N)=C1C#N)c1cc(cc(c1)C(F)(F)F)-c1cccc(CCC(O)=O)c1
InChI Key: InChIKey=ULXPNGMLUPLOIA-UHFFFAOYSA-N
Data: 1 IC50
PDB links: 1 PDB ID matches this monomer.
Activity Spreadsheet -- Enzyme Inhibition Constant Data from BindingDB
Found 1 hit for monomerid = 50239658
Trg + Lig
Ki
nM
ΔG°
kcal/mole
IC50
nM
Kd
nM
EC50/IC50
nM
koff
s-1
kon
M-1s-1
pHTemp
°C
SHMT
(Plasmodium falciparum)
BDBM50239658
(CHEMBL4100679)
Show SMILES CC(C)C1(c2c(C)[nH]nc2OC(N)=C1C#N)c1cc(cc(c1)C(F)(F)F)-c1cccc(CCC(O)=O)c1 |c:13|
Show InChI InChI=1S/C27H25F3N4O3/c1-14(2)26(21(13-31)24(32)37-25-23(26)15(3)33-34-25)19-10-18(11-20(12-19)27(28,29)30)17-6-4-5-16(9-17)7-8-22(35)36/h4-6,9-12,14H,7-8,32H2,1-3H3,(H,33,34)(H,35,36)
n/an/a 165n/an/an/an/an/an/a
Laboratorium f�r Organische Chemie, ETH Zurich , Vladimir-Prelog-Weg 3, 8093 Zurich, Switzerland.
Curated by ChEMBL
Assay Description
Inhibition of Plasmodium falciparum SHMT using L-serine/(6S)-THF as substrate by methylene tetrahydrofolate dehydrogenase coupled enzyme assay
J Med Chem 60: 4840-4860 (2017)
Article DOI: 10.1021/acs.jmedchem.7b00008
BindingDB Entry DOI: 10.7270/Q2959KPJ