BDBM50239806 CHEMBL4096290
SMILES: C(c1cc(no1)-c1ccccc1)n1ccnc1
InChI Key: InChIKey=IYYARIBXJBIGHX-UHFFFAOYSA-N
Data: 2 IC50
Activity Spreadsheet -- Enzyme Inhibition Constant Data from BindingDB
Found 2 hits for monomerid = 50239806
Trg + Lig
Ki
nM
ΔG°
kcal/mole
IC50
nM
Kd
nM
EC50/IC50
nM
koff
s-1
kon
M-1s-1
pHTemp
°C
Cytochrome P450 11B1
(Homo sapiens (Human))
BDBM50239806
(CHEMBL4096290)
Show SMILES C(c1cc(no1)-c1ccccc1)n1ccnc1
Show InChI InChI=1S/C13H11N3O/c1-2-4-11(5-3-1)13-8-12(17-15-13)9-16-7-6-14-10-16/h1-8,10H,9H2
n/an/a 148n/an/an/an/an/an/a
Saarland University
Curated by ChEMBL
Assay Description
Inhibition of human CYP11B1 expressed in hamster V79MZ cells using [1,2-3H]-11-deoxycorticosterone as substrate after 6 hrs by HPLC analysis
J Med Chem 60: 5086-5098 (2017)
Article DOI: 10.1021/acs.jmedchem.7b00437
BindingDB Entry DOI: 10.7270/Q24F1SWW
Cytochrome P450 11B2 (CYP11B2)
(Homo sapiens (Human))
BDBM50239806
(CHEMBL4096290)
Show SMILES C(c1cc(no1)-c1ccccc1)n1ccnc1
Show InChI InChI=1S/C13H11N3O/c1-2-4-11(5-3-1)13-8-12(17-15-13)9-16-7-6-14-10-16/h1-8,10H,9H2
n/an/a 1.30E+3n/an/an/an/an/an/a
Saarland University
Curated by ChEMBL
Assay Description
Inhibition of human CYP11B2 expressed in hamster V79MZ cells using [1,2-3H]-11-deoxycorticosterone as substrate after 6 hrs by HPLC analysis
J Med Chem 60: 5086-5098 (2017)
Article DOI: 10.1021/acs.jmedchem.7b00437
BindingDB Entry DOI: 10.7270/Q24F1SWW