BDBM50239812 CHEMBL4070031
SMILES: Cc1cncc(Cc2cnc(s2)-c2ccccc2)c1
InChI Key: InChIKey=UXLOJCRRCNBVEY-UHFFFAOYSA-N
Data: 2 IC50
Activity Spreadsheet -- Enzyme Inhibition Constant Data from BindingDB
Found 2 hits for monomerid = 50239812
Trg + Lig
Ki
nM
ΔG°
kcal/mole
IC50
nM
Kd
nM
EC50/IC50
nM
koff
s-1
kon
M-1s-1
pHTemp
°C
Cytochrome P450 11B2 (CYP11B2)
(Homo sapiens (Human))
BDBM50239812
(CHEMBL4070031)
Show SMILES Cc1cncc(Cc2cnc(s2)-c2ccccc2)c1
Show InChI InChI=1S/C16H14N2S/c1-12-7-13(10-17-9-12)8-15-11-18-16(19-15)14-5-3-2-4-6-14/h2-7,9-11H,8H2,1H3
n/an/a 24n/an/an/an/an/an/a
Saarland University
Curated by ChEMBL
Assay Description
Inhibition of human CYP11B2 expressed in hamster V79MZ cells using [1,2-3H]-11-deoxycorticosterone as substrate after 6 hrs by HPLC analysis
J Med Chem 60: 5086-5098 (2017)
Article DOI: 10.1021/acs.jmedchem.7b00437
BindingDB Entry DOI: 10.7270/Q24F1SWW
Cytochrome P450 11B1
(Homo sapiens (Human))
BDBM50239812
(CHEMBL4070031)
Show SMILES Cc1cncc(Cc2cnc(s2)-c2ccccc2)c1
Show InChI InChI=1S/C16H14N2S/c1-12-7-13(10-17-9-12)8-15-11-18-16(19-15)14-5-3-2-4-6-14/h2-7,9-11H,8H2,1H3
n/an/a 9n/an/an/an/an/an/a
Saarland University
Curated by ChEMBL
Assay Description
Inhibition of human CYP11B1 expressed in hamster V79MZ cells using [1,2-3H]-11-deoxycorticosterone as substrate after 6 hrs by HPLC analysis
J Med Chem 60: 5086-5098 (2017)
Article DOI: 10.1021/acs.jmedchem.7b00437
BindingDB Entry DOI: 10.7270/Q24F1SWW