BDBM50239816 CHEMBL4101613
SMILES: Cn1nc(cc1Cn1ccnc1)-c1ccccc1
InChI Key: InChIKey=OHSCTDSHNFDXJN-UHFFFAOYSA-N
Data: 2 IC50
Activity Spreadsheet -- Enzyme Inhibition Constant Data from BindingDB
Found 2 hits for monomerid = 50239816
Trg + Lig
Ki
nM
ΔG°
kcal/mole
IC50
nM
Kd
nM
EC50/IC50
nM
koff
s-1
kon
M-1s-1
pHTemp
°C
Cytochrome P450 11B1
(Homo sapiens (Human))
BDBM50239816
(CHEMBL4101613)
Show SMILES Cn1nc(cc1Cn1ccnc1)-c1ccccc1
Show InChI InChI=1S/C14H14N4/c1-17-13(10-18-8-7-15-11-18)9-14(16-17)12-5-3-2-4-6-12/h2-9,11H,10H2,1H3
n/an/a 58n/an/an/an/an/an/a
Saarland University
Curated by ChEMBL
Assay Description
Inhibition of human CYP11B1 expressed in hamster V79MZ cells using [1,2-3H]-11-deoxycorticosterone as substrate after 6 hrs by HPLC analysis
J Med Chem 60: 5086-5098 (2017)
Article DOI: 10.1021/acs.jmedchem.7b00437
BindingDB Entry DOI: 10.7270/Q24F1SWW
Cytochrome P450 11B2 (CYP11B2)
(Homo sapiens (Human))
BDBM50239816
(CHEMBL4101613)
Show SMILES Cn1nc(cc1Cn1ccnc1)-c1ccccc1
Show InChI InChI=1S/C14H14N4/c1-17-13(10-18-8-7-15-11-18)9-14(16-17)12-5-3-2-4-6-12/h2-9,11H,10H2,1H3
n/an/a 215n/an/an/an/an/an/a
Saarland University
Curated by ChEMBL
Assay Description
Inhibition of human CYP11B2 expressed in hamster V79MZ cells using [1,2-3H]-11-deoxycorticosterone as substrate after 6 hrs by HPLC analysis
J Med Chem 60: 5086-5098 (2017)
Article DOI: 10.1021/acs.jmedchem.7b00437
BindingDB Entry DOI: 10.7270/Q24F1SWW