BDBM50239841 CHEMBL4101083
SMILES: CCc1ccc(cc1)-c1c(cnn1C)-c1nn(C)c2ncnc(N3CCCC3)c12
InChI Key: InChIKey=BGZYJKPTONPZAH-UHFFFAOYSA-N
Data: 1 IC50
Activity Spreadsheet -- Enzyme Inhibition Constant Data from BindingDB
Found 1 hit for monomerid = 50239841
Trg + Lig
Ki
nM
ΔG°
kcal/mole
IC50
nM
Kd
nM
EC50/IC50
nM
koff
s-1
kon
M-1s-1
pHTemp
°C
Homo sapiens phosphodiesterase 2A (PDE2A)
(Homo sapiens (Human))
BDBM50239841
(CHEMBL4101083)
Show SMILES CCc1ccc(cc1)-c1c(cnn1C)-c1nn(C)c2ncnc(N3CCCC3)c12
Show InChI InChI=1S/C22H25N7/c1-4-15-7-9-16(10-8-15)20-17(13-25-27(20)2)19-18-21(28(3)26-19)23-14-24-22(18)29-11-5-6-12-29/h7-10,13-14H,4-6,11-12H2,1-3H3
n/an/a 7.80n/an/an/an/an/an/a
Pfizer Inc.
Curated by ChEMBL
Assay Description
Inhibition of full length recombinant human FLAG-tagged PDE2A3 expressed in sf21 cells using [3H]cGMP as substrate by scintillation proximity assay
J Med Chem 60: 5673-5698 (2017)
Article DOI: 10.1021/acs.jmedchem.7b00397
BindingDB Entry DOI: 10.7270/Q2VX0JNT