BDBM50239851 CHEMBL4074798
SMILES: COc1ccccc1CCOc1cncc2nnc(CC(C)C)n12
InChI Key: InChIKey=VHLGQXDYVLGVOI-UHFFFAOYSA-N
Data: 1 IC50
PDB links: 1 PDB ID matches this monomer.
Activity Spreadsheet -- Enzyme Inhibition Constant Data from BindingDB
Found 1 hit for monomerid = 50239851
Trg + Lig
Ki
nM
ΔG°
kcal/mole
IC50
nM
Kd
nM
EC50/IC50
nM
koff
s-1
kon
M-1s-1
pHTemp
°C
Homo sapiens phosphodiesterase 2A (PDE2A)
(Homo sapiens (Human))
BDBM50239851
(CHEMBL4074798)
Show SMILES COc1ccccc1CCOc1cncc2nnc(CC(C)C)n12
Show InChI InChI=1S/C18H22N4O2/c1-13(2)10-16-20-21-17-11-19-12-18(22(16)17)24-9-8-14-6-4-5-7-15(14)23-3/h4-7,11-13H,8-10H2,1-3H3
n/an/a 390n/an/an/an/an/an/a
Pfizer Inc.
Curated by ChEMBL
Assay Description
Inhibition of full length recombinant human FLAG-tagged PDE2A3 expressed in sf21 cells using [3H]cGMP as substrate by scintillation proximity assay
J Med Chem 60: 5673-5698 (2017)
Article DOI: 10.1021/acs.jmedchem.7b00397
BindingDB Entry DOI: 10.7270/Q2VX0JNT
3D
3D Structure (crystal)