BDBM50239869 CHEMBL4084949
SMILES: O=C1Nc2cc(=O)n(Cc3ccccc3)cc2CN1c1cccc(OCc2cncs2)c1
InChI Key: InChIKey=GAWVULNDIBAUHU-UHFFFAOYSA-N
Data: 5 IC50
Activity Spreadsheet -- Enzyme Inhibition Constant Data from BindingDB
Found 5 hits for monomerid = 50239869
Trg + Lig
Ki
nM
ΔG°
kcal/mole
IC50
nM
Kd
nM
EC50/IC50
nM
koff
s-1
kon
M-1s-1
pHTemp
°C
U5 small nuclear ribonucleoprotein 200 kDa helicase
(Homo sapiens (Human))
BDBM50239869
(CHEMBL4084949)
Show SMILES O=C1Nc2cc(=O)n(Cc3ccccc3)cc2CN1c1cccc(OCc2cncs2)c1
Show InChI InChI=1S/C24H20N4O3S/c29-23-10-22-18(13-27(23)12-17-5-2-1-3-6-17)14-28(24(30)26-22)19-7-4-8-20(9-19)31-15-21-11-25-16-32-21/h1-11,13,16H,12,14-15H2,(H,26,30)
n/an/a 79n/an/an/an/an/an/a
Takeda California Inc.
Curated by ChEMBL
Assay Description
Inhibition of full length recombinant human N-terminal His-tagged BRR2 RNA dependent ATPase activity expressed in baculovirus infected Sf9 cells usin...
J Med Chem 60: 5759-5771 (2017)
Article DOI: 10.1021/acs.jmedchem.7b00461
BindingDB Entry DOI: 10.7270/Q2MC925G
Eukaryotic initiation factor 4A-III
(Homo sapiens (Human))
BDBM50239869
(CHEMBL4084949)
Show SMILES O=C1Nc2cc(=O)n(Cc3ccccc3)cc2CN1c1cccc(OCc2cncs2)c1
Show InChI InChI=1S/C24H20N4O3S/c29-23-10-22-18(13-27(23)12-17-5-2-1-3-6-17)14-28(24(30)26-22)19-7-4-8-20(9-19)31-15-21-11-25-16-32-21/h1-11,13,16H,12,14-15H2,(H,26,30)
n/an/a>1.00E+5n/an/an/an/an/an/a
Takeda California Inc.
Curated by ChEMBL
Assay Description
Inhibition of MLN51-induced full length recombinant human N-terminal His6/SUMO-tagged eIF4A3 RNA dependent ATPase activity expressed in Escherichia c...
J Med Chem 60: 5759-5771 (2017)
Article DOI: 10.1021/acs.jmedchem.7b00461
BindingDB Entry DOI: 10.7270/Q2MC925G
Eukaryotic initiation factor 4A-I
(Homo sapiens (Human))
BDBM50239869
(CHEMBL4084949)
Show SMILES O=C1Nc2cc(=O)n(Cc3ccccc3)cc2CN1c1cccc(OCc2cncs2)c1
Show InChI InChI=1S/C24H20N4O3S/c29-23-10-22-18(13-27(23)12-17-5-2-1-3-6-17)14-28(24(30)26-22)19-7-4-8-20(9-19)31-15-21-11-25-16-32-21/h1-11,13,16H,12,14-15H2,(H,26,30)
Reactome pathway
n/an/a>1.00E+5n/an/an/an/an/an/a
Takeda California Inc.
Curated by ChEMBL
Assay Description
Inhibition of eIF4G-induced full length recombinant human N-terminal His6/SUMO-tagged eIF4A1 RNA dependent ATPase activity expressed in Escherichia c...
J Med Chem 60: 5759-5771 (2017)
Article DOI: 10.1021/acs.jmedchem.7b00461
BindingDB Entry DOI: 10.7270/Q2MC925G
U5 small nuclear ribonucleoprotein 200 kDa helicase
(Homo sapiens (Human))
BDBM50239869
(CHEMBL4084949)
Show SMILES O=C1Nc2cc(=O)n(Cc3ccccc3)cc2CN1c1cccc(OCc2cncs2)c1
Show InChI InChI=1S/C24H20N4O3S/c29-23-10-22-18(13-27(23)12-17-5-2-1-3-6-17)14-28(24(30)26-22)19-7-4-8-20(9-19)31-15-21-11-25-16-32-21/h1-11,13,16H,12,14-15H2,(H,26,30)
n/an/a 1.30E+3n/an/an/an/an/an/a
Takeda California Inc.
Curated by ChEMBL
Assay Description
Inhibition of full length recombinant human N-terminal His-tagged BRR2 helicase activity expressed in baculovirus infected Sf9 cells assessed as redu...
J Med Chem 60: 5759-5771 (2017)
Article DOI: 10.1021/acs.jmedchem.7b00461
BindingDB Entry DOI: 10.7270/Q2MC925G
ATP-dependent RNA helicase DHX29
(Homo sapiens (Human))
BDBM50239869
(CHEMBL4084949)
Show SMILES O=C1Nc2cc(=O)n(Cc3ccccc3)cc2CN1c1cccc(OCc2cncs2)c1
Show InChI InChI=1S/C24H20N4O3S/c29-23-10-22-18(13-27(23)12-17-5-2-1-3-6-17)14-28(24(30)26-22)19-7-4-8-20(9-19)31-15-21-11-25-16-32-21/h1-11,13,16H,12,14-15H2,(H,26,30)
n/an/a>1.00E+5n/an/an/an/an/an/a
Takeda California Inc.
Curated by ChEMBL
Assay Description
Inhibition of full length recombinant human N-terminal FLAG-His-tagged DHX29 RNA dependent ATPase activity expressed in baculovirus infected Sf9 inse...
J Med Chem 60: 5759-5771 (2017)
Article DOI: 10.1021/acs.jmedchem.7b00461
BindingDB Entry DOI: 10.7270/Q2MC925G