BDBM50239949 CHEMBL4098541
SMILES: CNC(=O)[C@H](NC(=O)c1ccc(o1)-c1ccc(CSc2nc3CCCc3c(=O)[nH]2)c(F)c1)C(C)C
InChI Key: InChIKey=NWCGLZSPRJCLHZ-OAQYLSRUSA-N
Data: 12 IC50
Activity Spreadsheet -- Enzyme Inhibition Constant Data from BindingDB
Found 12 hits for monomerid = 50239949
Trg + Lig
Ki
nM
ΔG°
kcal/mole
IC50
nM
Kd
nM
EC50/IC50
nM
koff
s-1
kon
M-1s-1
pHTemp
°C
Matrix metalloproteinase-9
(Homo sapiens (Human))
BDBM50239949
(CHEMBL4098541)
Show SMILES CNC(=O)[C@H](NC(=O)c1ccc(o1)-c1ccc(CSc2nc3CCCc3c(=O)[nH]2)c(F)c1)C(C)C |r|
Show InChI InChI=1S/C25H27FN4O4S/c1-13(2)21(24(33)27-3)29-23(32)20-10-9-19(34-20)14-7-8-15(17(26)11-14)12-35-25-28-18-6-4-5-16(18)22(31)30-25/h7-11,13,21H,4-6,12H2,1-3H3,(H,27,33)(H,29,32)(H,28,30,31)/t21-/m1/s1
Reactome pathway
n/an/a>5.00E+3n/an/an/an/an/an/a
Department of Chemistry, Scripps Florida , 130 Scripps Way, Jupiter, Florida 33458, United States.
Curated by ChEMBL
Assay Description
Inhibition of MMP9 (unknown origin) using fTHP-15 as substrate preincubated for 30 mins followed by substrate addition measured immediately by fluore...
J Med Chem 60: 5816-5825 (2017)
Article DOI: 10.1021/acs.jmedchem.7b00514
BindingDB Entry DOI: 10.7270/Q23F4RTD
Matrix metalloproteinase-14
(Homo sapiens (Human))
BDBM50239949
(CHEMBL4098541)
Show SMILES CNC(=O)[C@H](NC(=O)c1ccc(o1)-c1ccc(CSc2nc3CCCc3c(=O)[nH]2)c(F)c1)C(C)C |r|
Show InChI InChI=1S/C25H27FN4O4S/c1-13(2)21(24(33)27-3)29-23(32)20-10-9-19(34-20)14-7-8-15(17(26)11-14)12-35-25-28-18-6-4-5-16(18)22(31)30-25/h7-11,13,21H,4-6,12H2,1-3H3,(H,27,33)(H,29,32)(H,28,30,31)/t21-/m1/s1
n/an/a>5.00E+3n/an/an/an/an/an/a
Department of Chemistry, Scripps Florida , 130 Scripps Way, Jupiter, Florida 33458, United States.
Curated by ChEMBL
Assay Description
Non-competitive inhibition of aminopeptidase B or arginyl aminopeptidase purified from rat liver; Ki value reporting the Kid
J Med Chem 60: 5816-5825 (2017)
Article DOI: 10.1021/acs.jmedchem.7b00514
BindingDB Entry DOI: 10.7270/Q23F4RTD
Interstitial collagenase
(Homo sapiens (Human))
BDBM50239949
(CHEMBL4098541)
Show SMILES CNC(=O)[C@H](NC(=O)c1ccc(o1)-c1ccc(CSc2nc3CCCc3c(=O)[nH]2)c(F)c1)C(C)C |r|
Show InChI InChI=1S/C25H27FN4O4S/c1-13(2)21(24(33)27-3)29-23(32)20-10-9-19(34-20)14-7-8-15(17(26)11-14)12-35-25-28-18-6-4-5-16(18)22(31)30-25/h7-11,13,21H,4-6,12H2,1-3H3,(H,27,33)(H,29,32)(H,28,30,31)/t21-/m1/s1
Reactome pathway
n/an/a>5.00E+3n/an/an/an/an/an/a
Department of Chemistry, Scripps Florida , 130 Scripps Way, Jupiter, Florida 33458, United States.
Curated by ChEMBL
Assay Description
Inhibition of recombinant human MMP1 expressed in mouse NSO cells using fTHP-15 as substrate preincubated for 30 mins followed by substrate addition ...
J Med Chem 60: 5816-5825 (2017)
Article DOI: 10.1021/acs.jmedchem.7b00514
BindingDB Entry DOI: 10.7270/Q23F4RTD
72 kDa type IV collagenase
(Homo sapiens (Human))
BDBM50239949
(CHEMBL4098541)
Show SMILES CNC(=O)[C@H](NC(=O)c1ccc(o1)-c1ccc(CSc2nc3CCCc3c(=O)[nH]2)c(F)c1)C(C)C |r|
Show InChI InChI=1S/C25H27FN4O4S/c1-13(2)21(24(33)27-3)29-23(32)20-10-9-19(34-20)14-7-8-15(17(26)11-14)12-35-25-28-18-6-4-5-16(18)22(31)30-25/h7-11,13,21H,4-6,12H2,1-3H3,(H,27,33)(H,29,32)(H,28,30,31)/t21-/m1/s1
Reactome pathway
n/an/a 3.10E+3n/an/an/an/an/an/a
Department of Chemistry, Scripps Florida , 130 Scripps Way, Jupiter, Florida 33458, United States.
Curated by ChEMBL
Assay Description
Inhibition of recombinant human MMP2 expressed in mouse NSO cells using fTHP-15 as substrate preincubated for 30 mins followed by substrate addition ...
J Med Chem 60: 5816-5825 (2017)
Article DOI: 10.1021/acs.jmedchem.7b00514
BindingDB Entry DOI: 10.7270/Q23F4RTD
Neutrophil collagenase
(Homo sapiens (Human))
BDBM50239949
(CHEMBL4098541)
Show SMILES CNC(=O)[C@H](NC(=O)c1ccc(o1)-c1ccc(CSc2nc3CCCc3c(=O)[nH]2)c(F)c1)C(C)C |r|
Show InChI InChI=1S/C25H27FN4O4S/c1-13(2)21(24(33)27-3)29-23(32)20-10-9-19(34-20)14-7-8-15(17(26)11-14)12-35-25-28-18-6-4-5-16(18)22(31)30-25/h7-11,13,21H,4-6,12H2,1-3H3,(H,27,33)(H,29,32)(H,28,30,31)/t21-/m1/s1
Reactome pathway
n/an/a>5.00E+3n/an/an/an/an/an/a
Department of Chemistry, Scripps Florida , 130 Scripps Way, Jupiter, Florida 33458, United States.
Curated by ChEMBL
Assay Description
Inhibition of MMP8 (unknown origin) using fTHP-15 as substrate preincubated for 30 mins followed by substrate addition measured immediately by fluore...
J Med Chem 60: 5816-5825 (2017)
Article DOI: 10.1021/acs.jmedchem.7b00514
BindingDB Entry DOI: 10.7270/Q23F4RTD
72 kDa type IV collagenase
(Homo sapiens (Human))
BDBM50239949
(CHEMBL4098541)
Show SMILES CNC(=O)[C@H](NC(=O)c1ccc(o1)-c1ccc(CSc2nc3CCCc3c(=O)[nH]2)c(F)c1)C(C)C |r|
Show InChI InChI=1S/C25H27FN4O4S/c1-13(2)21(24(33)27-3)29-23(32)20-10-9-19(34-20)14-7-8-15(17(26)11-14)12-35-25-28-18-6-4-5-16(18)22(31)30-25/h7-11,13,21H,4-6,12H2,1-3H3,(H,27,33)(H,29,32)(H,28,30,31)/t21-/m1/s1
Reactome pathway
n/an/a>5.00E+3n/an/an/an/an/an/a
Graz University of Technology
Curated by ChEMBL
Assay Description
Inhibition of recombinant human MMP2 using fTHP-15 as substrate preincubated for 30 mins followed by substrate addition by fluorescence assay
Bioorg Med Chem 26: 4984-4995 (2018)
Article DOI: 10.1016/j.bmc.2018.08.020
BindingDB Entry DOI: 10.7270/Q25141SR
Interstitial collagenase
(Homo sapiens (Human))
BDBM50239949
(CHEMBL4098541)
Show SMILES CNC(=O)[C@H](NC(=O)c1ccc(o1)-c1ccc(CSc2nc3CCCc3c(=O)[nH]2)c(F)c1)C(C)C |r|
Show InChI InChI=1S/C25H27FN4O4S/c1-13(2)21(24(33)27-3)29-23(32)20-10-9-19(34-20)14-7-8-15(17(26)11-14)12-35-25-28-18-6-4-5-16(18)22(31)30-25/h7-11,13,21H,4-6,12H2,1-3H3,(H,27,33)(H,29,32)(H,28,30,31)/t21-/m1/s1
Reactome pathway
n/an/a>5.00E+3n/an/an/an/an/an/a
Graz University of Technology
Curated by ChEMBL
Assay Description
Inhibition of recombinant human MMP1 expressed in mouse NS0 cells using Knight substrate preincubated for 30 mins followed by substrate addition by f...
Bioorg Med Chem 26: 4984-4995 (2018)
Article DOI: 10.1016/j.bmc.2018.08.020
BindingDB Entry DOI: 10.7270/Q25141SR
Neutrophil collagenase
(Homo sapiens (Human))
BDBM50239949
(CHEMBL4098541)
Show SMILES CNC(=O)[C@H](NC(=O)c1ccc(o1)-c1ccc(CSc2nc3CCCc3c(=O)[nH]2)c(F)c1)C(C)C |r|
Show InChI InChI=1S/C25H27FN4O4S/c1-13(2)21(24(33)27-3)29-23(32)20-10-9-19(34-20)14-7-8-15(17(26)11-14)12-35-25-28-18-6-4-5-16(18)22(31)30-25/h7-11,13,21H,4-6,12H2,1-3H3,(H,27,33)(H,29,32)(H,28,30,31)/t21-/m1/s1
Reactome pathway
n/an/a>5.00E+3n/an/an/an/an/an/a
Graz University of Technology
Curated by ChEMBL
Assay Description
Inhibition of recombinant human MMP8 expressed in mouse NS0 cells using Knight substrate preincubated for 30 mins followed by substrate addition by f...
Bioorg Med Chem 26: 4984-4995 (2018)
Article DOI: 10.1016/j.bmc.2018.08.020
BindingDB Entry DOI: 10.7270/Q25141SR
Matrix metalloproteinase-9
(Homo sapiens (Human))
BDBM50239949
(CHEMBL4098541)
Show SMILES CNC(=O)[C@H](NC(=O)c1ccc(o1)-c1ccc(CSc2nc3CCCc3c(=O)[nH]2)c(F)c1)C(C)C |r|
Show InChI InChI=1S/C25H27FN4O4S/c1-13(2)21(24(33)27-3)29-23(32)20-10-9-19(34-20)14-7-8-15(17(26)11-14)12-35-25-28-18-6-4-5-16(18)22(31)30-25/h7-11,13,21H,4-6,12H2,1-3H3,(H,27,33)(H,29,32)(H,28,30,31)/t21-/m1/s1
Reactome pathway
n/an/a>5.00E+3n/an/an/an/an/an/a
Graz University of Technology
Curated by ChEMBL
Assay Description
Inhibition of recombinant human MMP9 using fTHP-15 as substrate preincubated for 30 mins followed by substrate addition by fluorescence assay
Bioorg Med Chem 26: 4984-4995 (2018)
Article DOI: 10.1016/j.bmc.2018.08.020
BindingDB Entry DOI: 10.7270/Q25141SR
Matrix metalloproteinase-14
(Homo sapiens (Human))
BDBM50239949
(CHEMBL4098541)
Show SMILES CNC(=O)[C@H](NC(=O)c1ccc(o1)-c1ccc(CSc2nc3CCCc3c(=O)[nH]2)c(F)c1)C(C)C |r|
Show InChI InChI=1S/C25H27FN4O4S/c1-13(2)21(24(33)27-3)29-23(32)20-10-9-19(34-20)14-7-8-15(17(26)11-14)12-35-25-28-18-6-4-5-16(18)22(31)30-25/h7-11,13,21H,4-6,12H2,1-3H3,(H,27,33)(H,29,32)(H,28,30,31)/t21-/m1/s1
n/an/a>5.00E+3n/an/an/an/an/an/a
Graz University of Technology
Curated by ChEMBL
Assay Description
Inhibition of recombinant human MMP14 expressed in Escherichia coli using fTHP-15 as substrate preincubated for 30 mins followed by substrate additio...
Bioorg Med Chem 26: 4984-4995 (2018)
Article DOI: 10.1016/j.bmc.2018.08.020
BindingDB Entry DOI: 10.7270/Q25141SR
Collagenase 3
(Homo sapiens (Human))
BDBM50239949
(CHEMBL4098541)
Show SMILES CNC(=O)[C@H](NC(=O)c1ccc(o1)-c1ccc(CSc2nc3CCCc3c(=O)[nH]2)c(F)c1)C(C)C |r|
Show InChI InChI=1S/C25H27FN4O4S/c1-13(2)21(24(33)27-3)29-23(32)20-10-9-19(34-20)14-7-8-15(17(26)11-14)12-35-25-28-18-6-4-5-16(18)22(31)30-25/h7-11,13,21H,4-6,12H2,1-3H3,(H,27,33)(H,29,32)(H,28,30,31)/t21-/m1/s1
NCI pathway
Reactome pathway
n/an/a 257n/an/an/an/an/an/a
Graz University of Technology
Curated by ChEMBL
Assay Description
Inhibition of recombinant human full length MMP13 expressed in mouse NS0 cells using fTHP-15 as substrate preincubated for 30 mins followed by substr...
Bioorg Med Chem 26: 4984-4995 (2018)
Article DOI: 10.1016/j.bmc.2018.08.020
BindingDB Entry DOI: 10.7270/Q25141SR
Collagenase 3
(Homo sapiens (Human))
BDBM50239949
(CHEMBL4098541)
Show SMILES CNC(=O)[C@H](NC(=O)c1ccc(o1)-c1ccc(CSc2nc3CCCc3c(=O)[nH]2)c(F)c1)C(C)C |r|
Show InChI InChI=1S/C25H27FN4O4S/c1-13(2)21(24(33)27-3)29-23(32)20-10-9-19(34-20)14-7-8-15(17(26)11-14)12-35-25-28-18-6-4-5-16(18)22(31)30-25/h7-11,13,21H,4-6,12H2,1-3H3,(H,27,33)(H,29,32)(H,28,30,31)/t21-/m1/s1
NCI pathway
Reactome pathway
n/an/a 257n/an/an/an/an/an/a
Department of Chemistry, Scripps Florida , 130 Scripps Way, Jupiter, Florida 33458, United States.
Curated by ChEMBL
Assay Description
Inhibition of full length recombinant human MMP13 expressed in mouse NSO cells using fTHP-15 as substrate preincubated for 30 mins followed by substr...
J Med Chem 60: 5816-5825 (2017)
Article DOI: 10.1021/acs.jmedchem.7b00514
BindingDB Entry DOI: 10.7270/Q23F4RTD