BDBM50240823 CHEMBL4083273
SMILES: CC[C@H](C)[C@H](NC(=O)[C@H](Cc1ccccc1)NC(=O)[C@H](CCC(O)=O)NC(=O)[C@H](CCCCNC(=O)COc1ccc(cc1C(O)=O)-c1ccccc1)NC(=O)[C@H](C)NC(=O)[C@H](C)NC(=O)[C@H](CCC(N)=O)NC(=O)CNC(=O)[C@H](CCC(O)=O)NC(=O)[C@H](CC(C)C)NC(=O)[C@H](Cc1ccc(O)cc1)NC(=O)[C@H](CO)NC(=O)[C@H](CO)NC(=O)[C@@H](NC(=O)[C@H](CC(O)=O)NC(=O)[C@H](CO)NC(=O)[C@@H](NC(=O)[C@H](Cc1ccccc1)NC(=O)[C@@H](NC(=O)CNC(=O)[C@H](CCC(O)=O)NC(=O)[C@H](C)NC(=O)[C@@H](N)Cc1cnc[nH]1)[C@@H](C)O)[C@@H](C)O)C(C)C)C(=O)N[C@@H](C)C(=O)N[C@@H](Cc1c[nH]c2ccccc12)C(=O)N[C@@H](CC(C)C)C(=O)N[C@@H](C(C)C)C(=O)N[C@@H](CCCNC(N)=N)C(=O)NCC(=O)N[C@@H](CCCNC(N)=N)C(=O)NCC(O)=O
InChI Key: InChIKey=RCSDQEFAFLLORA-CUNKRARFSA-N
Data: 1 EC50
Activity Spreadsheet -- Enzyme Inhibition Constant Data from BindingDB
Found 1 hit for monomerid = 50240823
Trg + Lig
Ki
nM
ΔG°
kcal/mole
IC50
nM
Kd
nM
EC50/IC50
nM
koff
s-1
kon
M-1s-1
pHTemp
°C
Glucagon-like peptide 1 receptor
(Homo sapiens (Human))
BDBM50240823
(CHEMBL4083273)
Show SMILES CC[C@H](C)[C@H](NC(=O)[C@H](Cc1ccccc1)NC(=O)[C@H](CCC(O)=O)NC(=O)[C@H](CCCCNC(=O)COc1ccc(cc1C(O)=O)-c1ccccc1)NC(=O)[C@H](C)NC(=O)[C@H](C)NC(=O)[C@H](CCC(N)=O)NC(=O)CNC(=O)[C@H](CCC(O)=O)NC(=O)[C@H](CC(C)C)NC(=O)[C@H](Cc1ccc(O)cc1)NC(=O)[C@H](CO)NC(=O)[C@H](CO)NC(=O)[C@@H](NC(=O)[C@H](CC(O)=O)NC(=O)[C@H](CO)NC(=O)[C@@H](NC(=O)[C@H](Cc1ccccc1)NC(=O)[C@@H](NC(=O)CNC(=O)[C@H](CCC(O)=O)NC(=O)[C@H](C)NC(=O)[C@@H](N)Cc1cnc[nH]1)[C@@H](C)O)[C@@H](C)O)C(C)C)C(=O)N[C@@H](C)C(=O)N[C@@H](Cc1c[nH]c2ccccc12)C(=O)N[C@@H](CC(C)C)C(=O)N[C@@H](C(C)C)C(=O)N[C@@H](CCCNC(N)=N)C(=O)NCC(=O)N[C@@H](CCCNC(N)=N)C(=O)NCC(O)=O |r|
Show InChI InChI=1S/C166H238N42O51/c1-17-85(10)134(161(254)186-89(14)140(233)194-116(67-97-70-177-103-40-28-27-39-100(97)103)151(244)196-112(62-82(4)5)152(245)205-132(83(6)7)159(252)193-105(43-32-60-176-166(171)172)143(236)178-72-123(216)187-104(42-31-59-175-165(169)170)142(235)181-75-131(228)229)207-153(246)114(63-92-33-21-18-22-34-92)197-148(241)110(52-57-129(224)225)192-147(240)106(41-29-30-58-174-126(219)79-259-121-53-46-96(66-101(121)164(257)258)95-37-25-20-26-38-95)189-138(231)87(12)183-137(230)86(11)185-146(239)109(49-54-122(168)215)188-124(217)73-179-145(238)108(51-56-128(222)223)191-149(242)111(61-81(2)3)195-150(243)113(65-94-44-47-99(214)48-45-94)198-156(249)118(76-209)201-158(251)120(78-211)202-160(253)133(84(8)9)206-155(248)117(69-130(226)227)199-157(250)119(77-210)203-163(256)136(91(16)213)208-154(247)115(64-93-35-23-19-24-36-93)200-162(255)135(90(15)212)204-125(218)74-180-144(237)107(50-55-127(220)221)190-139(232)88(13)184-141(234)102(167)68-98-71-173-80-182-98/h18-28,33-40,44-48,53,66,70-71,80-91,102,104-120,132-136,177,209-214H,17,29-32,41-43,49-52,54-65,67-69,72-79,167H2,1-16H3,(H2,168,215)(H,173,182)(H,174,219)(H,178,236)(H,179,238)(H,180,237)(H,181,235)(H,183,230)(H,184,234)(H,185,239)(H,186,254)(H,187,216)(H,188,217)(H,189,231)(H,190,232)(H,191,242)(H,192,240)(H,193,252)(H,194,233)(H,195,243)(H,196,244)(H,197,241)(H,198,249)(H,199,250)(H,200,255)(H,201,251)(H,202,253)(H,203,256)(H,204,218)(H,205,245)(H,206,248)(H,207,246)(H,208,247)(H,220,221)(H,222,223)(H,224,225)(H,226,227)(H,228,229)(H,257,258)(H4,169,170,175)(H4,171,172,176)/t85-,86-,87-,88-,89-,90+,91+,102-,104-,105-,106-,107-,108-,109-,110-,111-,112-,113-,114-,115-,116-,117-,118-,119-,120-,132-,133-,134-,135-,136-/m0/s1
n/an/an/an/a 0.118n/an/an/an/a
University of Copenhagen
Curated by ChEMBL
Assay Description
Binding affinity against dopamine receptor D2 by using [3H]spiperone as radioligand in caudate-putamen of monkey
J Med Chem 60: 7434-7446 (2017)
Article DOI: 10.1021/acs.jmedchem.7b00787
BindingDB Entry DOI: 10.7270/Q29S1T5W