BDBM50240827 CHEMBL4075828
SMILES: [H][C@]12CC[C@]([H])(N1C(=O)CNC(C)=O)c1cc(Nc3ncc(c(NC4CCC4)n3)C(F)(F)F)ccc21
InChI Key: InChIKey=RYYNGWLOYLRZLK-MOPGFXCFSA-N
Data: 2 Kd
Activity Spreadsheet -- Enzyme Inhibition Constant Data from BindingDB
Found 2 hits for monomerid = 50240827
Trg + Lig
Ki
nM
ΔG°
kcal/mole
IC50
nM
Kd
nM
EC50/IC50
nM
koff
s-1
kon
M-1s-1
pHTemp
°C
Wee1-like protein kinase 2
(Homo sapiens (Human))
BDBM50240827
(CHEMBL4075828)
Show SMILES [H][C@]12CC[C@]([H])(N1C(=O)CNC(C)=O)c1cc(Nc3ncc(c(NC4CCC4)n3)C(F)(F)F)ccc21 |r,TLB:7:6:35.14:3.2|
Show InChI InChI=1S/C23H25F3N6O2/c1-12(33)27-11-20(34)32-18-7-8-19(32)16-9-14(5-6-15(16)18)30-22-28-10-17(23(24,25)26)21(31-22)29-13-3-2-4-13/h5-6,9-10,13,18-19H,2-4,7-8,11H2,1H3,(H,27,33)(H2,28,29,30,31)/t18-,19+/m1/s1
n/an/an/a 128n/an/an/an/an/a
Moffitt Cancer Center
Curated by ChEMBL
Assay Description
Binding affinity to recombinant human N-terminal His6-tagged Wee2 kinase domain (202 to 492 residues) expressed in Escherichia coli BL21 (DE3) by iso...
J Med Chem 60: 7863-7875 (2017)
Article DOI: 10.1021/acs.jmedchem.7b00996
BindingDB Entry DOI: 10.7270/Q26112G9
Serine/threonine-protein kinase WEE1
(Homo sapiens (Human))
BDBM50240827
(CHEMBL4075828)
Show SMILES [H][C@]12CC[C@]([H])(N1C(=O)CNC(C)=O)c1cc(Nc3ncc(c(NC4CCC4)n3)C(F)(F)F)ccc21 |r,TLB:7:6:35.14:3.2|
Show InChI InChI=1S/C23H25F3N6O2/c1-12(33)27-11-20(34)32-18-7-8-19(32)16-9-14(5-6-15(16)18)30-22-28-10-17(23(24,25)26)21(31-22)29-13-3-2-4-13/h5-6,9-10,13,18-19H,2-4,7-8,11H2,1H3,(H,27,33)(H2,28,29,30,31)/t18-,19+/m1/s1
NCI pathway
Reactome pathway
n/an/an/a 79n/an/an/an/an/a
Moffitt Cancer Center
Curated by ChEMBL
Assay Description
Binding affinity to recombinant human N-terminal His6-tagged Wee1 kinase domain (291 to 575 residues) expressed in Escherichia coli BL21 (DE3) by iso...
J Med Chem 60: 7863-7875 (2017)
Article DOI: 10.1021/acs.jmedchem.7b00996
BindingDB Entry DOI: 10.7270/Q26112G9