BDBM50240934 3-(hydroxymethyl)-N-(3,3,3-trifluoropropyl)-1,2,3,4-tetrahydroisoquinoline-7-sulfonamide::3-Hydroxymethyl-1,2,3,4-tetrahydro-isoquinoline-7-sulfonic acid (3,3,3-trifluoro-propyl)-amide::CHEMBL175519
SMILES: OCC1Cc2ccc(cc2CN1)S(=O)(=O)NCCC(F)(F)F
InChI Key: InChIKey=BBGYNMHUJANUFW-UHFFFAOYSA-N
Data: 1 KI  1 IC50
Activity Spreadsheet -- Enzyme Inhibition Constant Data from BindingDB
Found 2 hits for monomerid = 50240934
Trg + Lig
Ki
nM
ΔG°
kcal/mole
IC50
nM
Kd
nM
EC50/IC50
nM
koff
s-1
kon
M-1s-1
pHTemp
°C
Phenylethanolamine N-methyltransferase
(Homo sapiens (Human))
BDBM50240934
(3-(hydroxymethyl)-N-(3,3,3-trifluoropropyl)-1,2,3,...)
Show SMILES OCC1Cc2ccc(cc2CN1)S(=O)(=O)NCCC(F)(F)F
Show InChI InChI=1S/C13H17F3N2O3S/c14-13(15,16)3-4-18-22(20,21)12-2-1-9-5-11(8-19)17-7-10(9)6-12/h1-2,6,11,17-19H,3-5,7-8H2
Reactome pathway
28n/an/an/an/an/an/an/an/a
University of Kansas
Curated by ChEMBL
Assay Description
In vitro binding affinity against human phenylethanolamine N-Methyltransferase
J Med Chem 48: 134-40 (2005)
Article DOI: 10.1021/jm049368n
BindingDB Entry DOI: 10.7270/Q2513XQ7
3D
3D Structure (docked)
Phenylethanolamine N-methyltransferase
(Homo sapiens (Human))
BDBM50240934
(3-(hydroxymethyl)-N-(3,3,3-trifluoropropyl)-1,2,3,...)
Show SMILES OCC1Cc2ccc(cc2CN1)S(=O)(=O)NCCC(F)(F)F
Show InChI InChI=1S/C13H17F3N2O3S/c14-13(15,16)3-4-18-22(20,21)12-2-1-9-5-11(8-19)17-7-10(9)6-12/h1-2,6,11,17-19H,3-5,7-8H2
Reactome pathway
n/an/a 28n/an/an/an/an/an/a
Astex Therapeutics Ltd.
Curated by ChEMBL
Assay Description
Inhibition of PNMT
J Med Chem 51: 3661-80 (2008)
Article DOI: 10.1021/jm8000373
BindingDB Entry DOI: 10.7270/Q2N58M4H
3D
3D Structure (docked)