BDBM50240955 CHEMBL4083571
SMILES: Cl.Oc1cccc(CCN(CCc2cccc(O)c2F)CC2CCC2)c1
InChI Key: InChIKey=QKYSREYQMCTXND-UHFFFAOYSA-N
Data: 3 KI  1 EC50
Activity Spreadsheet -- Enzyme Inhibition Constant Data from BindingDB
Found 4 hits for monomerid = 50240955
Trg + Lig
Ki
nM
ΔG°
kcal/mole
IC50
nM
Kd
nM
EC50/IC50
nM
koff
s-1
kon
M-1s-1
pHTemp
°C
Kappa-type opioid receptor
(Homo sapiens (Human))
BDBM50240955
(CHEMBL4083571)
Show SMILES Cl.Oc1cccc(CCN(CCc2cccc(O)c2F)CC2CCC2)c1
Show InChI InChI=1S/C21H26FNO2/c22-21-18(7-3-9-20(21)25)11-13-23(15-17-5-1-6-17)12-10-16-4-2-8-19(24)14-16/h2-4,7-9,14,17,24-25H,1,5-6,10-13,15H2
Reactome pathway
0.120n/an/an/an/an/an/an/an/a
University of Innsbruck
Curated by ChEMBL
Assay Description
Displacement of [3H]U69,593 from human kappa opioid receptor expressed in CHO cell membranes after 60 mins by liquid scintillation counting method
J Med Chem 60: 7579-7590 (2017)
Article DOI: 10.1021/acs.jmedchem.7b00981
BindingDB Entry DOI: 10.7270/Q21C202C
Mu-type opioid receptor
(Homo sapiens (Human))
BDBM50240955
(CHEMBL4083571)
Show SMILES Cl.Oc1cccc(CCN(CCc2cccc(O)c2F)CC2CCC2)c1
Show InChI InChI=1S/C21H26FNO2/c22-21-18(7-3-9-20(21)25)11-13-23(15-17-5-1-6-17)12-10-16-4-2-8-19(24)14-16/h2-4,7-9,14,17,24-25H,1,5-6,10-13,15H2
NCI pathway
Reactome pathway
557n/an/an/an/an/an/an/an/a
University of Innsbruck
Curated by ChEMBL
Assay Description
Displacement of [3H]DAMGO from human mu opioid receptor expressed in CHO cell membranes after 60 mins by liquid scintillation counting method
J Med Chem 60: 7579-7590 (2017)
Article DOI: 10.1021/acs.jmedchem.7b00981
BindingDB Entry DOI: 10.7270/Q21C202C
Delta-type opioid receptor
(Homo sapiens (Human))
BDBM50240955
(CHEMBL4083571)
Show SMILES Cl.Oc1cccc(CCN(CCc2cccc(O)c2F)CC2CCC2)c1
Show InChI InChI=1S/C21H26FNO2/c22-21-18(7-3-9-20(21)25)11-13-23(15-17-5-1-6-17)12-10-16-4-2-8-19(24)14-16/h2-4,7-9,14,17,24-25H,1,5-6,10-13,15H2
Reactome pathway
>1.00E+4n/an/an/an/an/an/an/an/a
University of Innsbruck
Curated by ChEMBL
Assay Description
Displacement of [3H]diprenorphine from human delta opioid receptor expressed in CHO cell membranes after 60 mins by liquid scintillation counting met...
J Med Chem 60: 7579-7590 (2017)
Article DOI: 10.1021/acs.jmedchem.7b00981
BindingDB Entry DOI: 10.7270/Q21C202C
Kappa-type opioid receptor
(Homo sapiens (Human))
BDBM50240955
(CHEMBL4083571)
Show SMILES Cl.Oc1cccc(CCN(CCc2cccc(O)c2F)CC2CCC2)c1
Show InChI InChI=1S/C21H26FNO2/c22-21-18(7-3-9-20(21)25)11-13-23(15-17-5-1-6-17)12-10-16-4-2-8-19(24)14-16/h2-4,7-9,14,17,24-25H,1,5-6,10-13,15H2
Reactome pathway
n/an/an/an/a 1.5n/an/an/an/a
University of Innsbruck
Curated by ChEMBL
Assay Description
Agonist activity at human kappa opioid receptor expressed in CHO cell membranes after 60 mins by [35S]GTPgammaS binding assay
J Med Chem 60: 7579-7590 (2017)
Article DOI: 10.1021/acs.jmedchem.7b00981
BindingDB Entry DOI: 10.7270/Q21C202C