BDBM50240970 CHEMBL4092640
SMILES: Cl.Oc1cccc(CCN(CCc2ccccc2)CC2CCCCC2)c1
InChI Key: InChIKey=VSXUTXKYNLMLGP-UHFFFAOYSA-N
Data: 3 KI  1 EC50
Activity Spreadsheet -- Enzyme Inhibition Constant Data from BindingDB
Found 4 hits for monomerid = 50240970
Trg + Lig
Ki
nM
ΔG°
kcal/mole
IC50
nM
Kd
nM
EC50/IC50
nM
koff
s-1
kon
M-1s-1
pHTemp
°C
Kappa-type opioid receptor
(Homo sapiens (Human))
BDBM50240970
(CHEMBL4092640)
Show SMILES Cl.Oc1cccc(CCN(CCc2ccccc2)CC2CCCCC2)c1
Show InChI InChI=1S/C23H31NO/c25-23-13-7-12-21(18-23)15-17-24(19-22-10-5-2-6-11-22)16-14-20-8-3-1-4-9-20/h1,3-4,7-9,12-13,18,22,25H,2,5-6,10-11,14-17,19H2
Reactome pathway
0.0610n/an/an/an/an/an/an/an/a
University of Innsbruck
Curated by ChEMBL
Assay Description
Displacement of [3H]U69,593 from human kappa opioid receptor expressed in CHO cell membranes after 60 mins by liquid scintillation counting method
J Med Chem 60: 7579-7590 (2017)
Article DOI: 10.1021/acs.jmedchem.7b00981
BindingDB Entry DOI: 10.7270/Q21C202C
Mu-type opioid receptor
(Homo sapiens (Human))
BDBM50240970
(CHEMBL4092640)
Show SMILES Cl.Oc1cccc(CCN(CCc2ccccc2)CC2CCCCC2)c1
Show InChI InChI=1S/C23H31NO/c25-23-13-7-12-21(18-23)15-17-24(19-22-10-5-2-6-11-22)16-14-20-8-3-1-4-9-20/h1,3-4,7-9,12-13,18,22,25H,2,5-6,10-11,14-17,19H2
NCI pathway
Reactome pathway
537n/an/an/an/an/an/an/an/a
University of Innsbruck
Curated by ChEMBL
Assay Description
Displacement of [3H]DAMGO from human mu opioid receptor expressed in CHO cell membranes after 60 mins by liquid scintillation counting method
J Med Chem 60: 7579-7590 (2017)
Article DOI: 10.1021/acs.jmedchem.7b00981
BindingDB Entry DOI: 10.7270/Q21C202C
Delta-type opioid receptor
(Homo sapiens (Human))
BDBM50240970
(CHEMBL4092640)
Show SMILES Cl.Oc1cccc(CCN(CCc2ccccc2)CC2CCCCC2)c1
Show InChI InChI=1S/C23H31NO/c25-23-13-7-12-21(18-23)15-17-24(19-22-10-5-2-6-11-22)16-14-20-8-3-1-4-9-20/h1,3-4,7-9,12-13,18,22,25H,2,5-6,10-11,14-17,19H2
Reactome pathway
2.14E+3n/an/an/an/an/an/an/an/a
University of Innsbruck
Curated by ChEMBL
Assay Description
Displacement of [3H]diprenorphine from human delta opioid receptor expressed in CHO cell membranes after 60 mins by liquid scintillation counting met...
J Med Chem 60: 7579-7590 (2017)
Article DOI: 10.1021/acs.jmedchem.7b00981
BindingDB Entry DOI: 10.7270/Q21C202C
Kappa-type opioid receptor
(Homo sapiens (Human))
BDBM50240970
(CHEMBL4092640)
Show SMILES Cl.Oc1cccc(CCN(CCc2ccccc2)CC2CCCCC2)c1
Show InChI InChI=1S/C23H31NO/c25-23-13-7-12-21(18-23)15-17-24(19-22-10-5-2-6-11-22)16-14-20-8-3-1-4-9-20/h1,3-4,7-9,12-13,18,22,25H,2,5-6,10-11,14-17,19H2
Reactome pathway
n/an/an/an/a 0.230n/an/an/an/a
University of Innsbruck
Curated by ChEMBL
Assay Description
Inhibition of [3H]WIN-35428 binding to rat striatal membrane dopamine transporter
J Med Chem 60: 7579-7590 (2017)
Article DOI: 10.1021/acs.jmedchem.7b00981
BindingDB Entry DOI: 10.7270/Q21C202C