BDBM50241011 CHEMBL4102854
SMILES: CNC(=O)c1ccc2CCc3cc(Nc4cc(NC(=O)c5ccccc5)c(F)cc4F)ccc3C(=O)c2c1
InChI Key: InChIKey=OGDMKOILWPDNQV-UHFFFAOYSA-N
Data: 1 IC50
Activity Spreadsheet -- Enzyme Inhibition Constant Data from BindingDB
Found 1 hit for monomerid = 50241011
Trg + Lig
Ki
nM
ΔG°
kcal/mole
IC50
nM
Kd
nM
EC50/IC50
nM
koff
s-1
kon
M-1s-1
pHTemp
°C
Mitogen-activated protein kinase 14
(Homo sapiens (Human))
BDBM50241011
(CHEMBL4102854)
Show SMILES CNC(=O)c1ccc2CCc3cc(Nc4cc(NC(=O)c5ccccc5)c(F)cc4F)ccc3C(=O)c2c1
Show InChI InChI=1S/C30H23F2N3O3/c1-33-29(37)20-10-8-17-7-9-19-13-21(11-12-22(19)28(36)23(17)14-20)34-26-16-27(25(32)15-24(26)31)35-30(38)18-5-3-2-4-6-18/h2-6,8,10-16,34H,7,9H2,1H3,(H,33,37)(H,35,38)
NCI pathway
Reactome pathway
n/an/a 0.700n/an/an/an/an/an/a
Eberhard-Karls-Universitaet Tuebingen
Curated by ChEMBL
Assay Description
Displacement of [3H]DSLET from delta opioid receptor in rat brain membrane
J Med Chem 60: 8027-8054 (2017)
Article DOI: 10.1021/acs.jmedchem.7b00745
BindingDB Entry DOI: 10.7270/Q2RV0QVZ