BDBM50241013 CHEMBL4066023
SMILES: OCC(O)CNC(=O)c1ccc2CCc3cc(Nc4cc(NC(=O)c5ccccc5)c(F)cc4F)ccc3C(=O)c2c1
InChI Key: InChIKey=VCNQDJGBRSYAHU-UHFFFAOYSA-N
Data: 2 IC50
Activity Spreadsheet -- Enzyme Inhibition Constant Data from BindingDB
Found 2 hits for monomerid = 50241013
Trg + Lig
Ki
nM
ΔG°
kcal/mole
IC50
nM
Kd
nM
EC50/IC50
nM
koff
s-1
kon
M-1s-1
pHTemp
°C
Mitogen-activated protein kinase 14
(Homo sapiens (Human))
BDBM50241013
(CHEMBL4066023)
Show SMILES OCC(O)CNC(=O)c1ccc2CCc3cc(Nc4cc(NC(=O)c5ccccc5)c(F)cc4F)ccc3C(=O)c2c1
Show InChI InChI=1S/C32H27F2N3O5/c33-26-14-27(34)29(37-32(42)19-4-2-1-3-5-19)15-28(26)36-22-10-11-24-20(12-22)8-6-18-7-9-21(13-25(18)30(24)40)31(41)35-16-23(39)17-38/h1-5,7,9-15,23,36,38-39H,6,8,16-17H2,(H,35,41)(H,37,42)
NCI pathway
Reactome pathway
n/an/a 59n/an/an/an/an/an/a
Eberhard-Karls-Universitaet Tuebingen
Curated by ChEMBL
Assay Description
Inhibition of P38 alpha MAPK in human whole blood assessed as reduction in TNF-alpha release after 10 mins by ELISA
J Med Chem 60: 8027-8054 (2017)
Article DOI: 10.1021/acs.jmedchem.7b00745
BindingDB Entry DOI: 10.7270/Q2RV0QVZ
Mitogen-activated protein kinase 14
(Homo sapiens (Human))
BDBM50241013
(CHEMBL4066023)
Show SMILES OCC(O)CNC(=O)c1ccc2CCc3cc(Nc4cc(NC(=O)c5ccccc5)c(F)cc4F)ccc3C(=O)c2c1
Show InChI InChI=1S/C32H27F2N3O5/c33-26-14-27(34)29(37-32(42)19-4-2-1-3-5-19)15-28(26)36-22-10-11-24-20(12-22)8-6-18-7-9-21(13-25(18)30(24)40)31(41)35-16-23(39)17-38/h1-5,7,9-15,23,36,38-39H,6,8,16-17H2,(H,35,41)(H,37,42)
NCI pathway
Reactome pathway
n/an/a 0.200n/an/an/an/an/an/a
Eberhard-Karls-Universitaet Tuebingen
Curated by ChEMBL
Assay Description
Inhibition of P38 alpha MAPK (unknown origin) by ELISA
J Med Chem 60: 8027-8054 (2017)
Article DOI: 10.1021/acs.jmedchem.7b00745
BindingDB Entry DOI: 10.7270/Q2RV0QVZ