BDBM50241018 CHEMBL4075759
SMILES: COC(=O)c1ccc2CCc3cc(Nc4ccc(F)c(NC(=O)c5ccccc5)c4)ccc3C(=O)c2c1
InChI Key: InChIKey=CJPDFTDKSYEQJF-UHFFFAOYSA-N
Data: 1 IC50
Activity Spreadsheet -- Enzyme Inhibition Constant Data from BindingDB
Found 1 hit for monomerid = 50241018
Trg + Lig
Ki
nM
ΔG°
kcal/mole
IC50
nM
Kd
nM
EC50/IC50
nM
koff
s-1
kon
M-1s-1
pHTemp
°C
Mitogen-activated protein kinase 14
(Homo sapiens (Human))
BDBM50241018
(CHEMBL4075759)
Show SMILES COC(=O)c1ccc2CCc3cc(Nc4ccc(F)c(NC(=O)c5ccccc5)c4)ccc3C(=O)c2c1
Show InChI InChI=1S/C30H23FN2O4/c1-37-30(36)21-10-8-18-7-9-20-15-22(11-13-24(20)28(34)25(18)16-21)32-23-12-14-26(31)27(17-23)33-29(35)19-5-3-2-4-6-19/h2-6,8,10-17,32H,7,9H2,1H3,(H,33,35)
NCI pathway
Reactome pathway
n/an/a 0.800n/an/an/an/an/an/a
Eberhard-Karls-Universitaet Tuebingen
Curated by ChEMBL
Assay Description
Inhibition of P38 alpha MAPK (unknown origin) by ELISA
J Med Chem 60: 8027-8054 (2017)
Article DOI: 10.1021/acs.jmedchem.7b00745
BindingDB Entry DOI: 10.7270/Q2RV0QVZ