BDBM50241061 CHEMBL4089021
SMILES: CNC(=O)c1ccc2CCc3cc(Nc4cc(NC(=O)c5ccc(F)cc5)c(F)cc4F)ccc3C(=O)c2c1
InChI Key: InChIKey=VYYNPDULDLOGGE-UHFFFAOYSA-N
Data: 1 IC50
Activity Spreadsheet -- Enzyme Inhibition Constant Data from BindingDB
Found 1 hit for monomerid = 50241061
Trg + Lig
Ki
nM
ΔG°
kcal/mole
IC50
nM
Kd
nM
EC50/IC50
nM
koff
s-1
kon
M-1s-1
pHTemp
°C
Mitogen-activated protein kinase 14
(Homo sapiens (Human))
BDBM50241061
(CHEMBL4089021)
Show SMILES CNC(=O)c1ccc2CCc3cc(Nc4cc(NC(=O)c5ccc(F)cc5)c(F)cc4F)ccc3C(=O)c2c1
Show InChI InChI=1S/C30H22F3N3O3/c1-34-29(38)19-5-3-16-2-4-18-12-21(10-11-22(18)28(37)23(16)13-19)35-26-15-27(25(33)14-24(26)32)36-30(39)17-6-8-20(31)9-7-17/h3,5-15,35H,2,4H2,1H3,(H,34,38)(H,36,39)
NCI pathway
Reactome pathway
n/an/a 0.400n/an/an/an/an/an/a
Eberhard-Karls-Universitaet Tuebingen
Curated by ChEMBL
Assay Description
Inhibition of P38 alpha MAPK (unknown origin) by ELISA
J Med Chem 60: 8027-8054 (2017)
Article DOI: 10.1021/acs.jmedchem.7b00745
BindingDB Entry DOI: 10.7270/Q2RV0QVZ