BDBM50241064 CHEMBL4084905
SMILES: COC(=O)c1ccc2COc3cc(Nc4ccc(F)c(NC(=O)c5ccccc5)c4)ccc3C(=O)c2c1
InChI Key: InChIKey=IBPFVBZVPJFDHK-UHFFFAOYSA-N
Data: 1 IC50
Activity Spreadsheet -- Enzyme Inhibition Constant Data from BindingDB
Found 1 hit for monomerid = 50241064
Trg + Lig
Ki
nM
ΔG°
kcal/mole
IC50
nM
Kd
nM
EC50/IC50
nM
koff
s-1
kon
M-1s-1
pHTemp
°C
Mitogen-activated protein kinase 14
(Homo sapiens (Human))
BDBM50241064
(CHEMBL4084905)
Show SMILES COC(=O)c1ccc2COc3cc(Nc4ccc(F)c(NC(=O)c5ccccc5)c4)ccc3C(=O)c2c1
Show InChI InChI=1S/C29H21FN2O5/c1-36-29(35)18-7-8-19-16-37-26-15-21(9-11-22(26)27(33)23(19)13-18)31-20-10-12-24(30)25(14-20)32-28(34)17-5-3-2-4-6-17/h2-15,31H,16H2,1H3,(H,32,34)
NCI pathway
Reactome pathway
n/an/a 1.20n/an/an/an/an/an/a
Eberhard-Karls-Universitaet Tuebingen
Curated by ChEMBL
Assay Description
Inhibition of P38 alpha MAPK (unknown origin) by ELISA
J Med Chem 60: 8027-8054 (2017)
Article DOI: 10.1021/acs.jmedchem.7b00745
BindingDB Entry DOI: 10.7270/Q2RV0QVZ