BDBM50241626 CHEMBL4080951
SMILES: COC(=O)[C@H](Cc1ccc(O)cc1)NC(=O)CC(c1ccccc1)c1ccccc1
InChI Key: InChIKey=QOVUJXDGZUQNAV-QHCPKHFHSA-N
Data: 2 IC50
Activity Spreadsheet -- Enzyme Inhibition Constant Data from BindingDB
Found 2 hits for monomerid = 50241626
Trg + Lig
Ki
nM
ΔG°
kcal/mole
IC50
nM
Kd
nM
EC50/IC50
nM
koff
s-1
kon
M-1s-1
pHTemp
°C
MDM2-MDMX
(Homo sapiens (Human))
BDBM50241626
(CHEMBL4080951)
Show SMILES COC(=O)[C@H](Cc1ccc(O)cc1)NC(=O)CC(c1ccccc1)c1ccccc1 |r|
Show InChI InChI=1S/C25H25NO4/c1-30-25(29)23(16-18-12-14-21(27)15-13-18)26-24(28)17-22(19-8-4-2-5-9-19)20-10-6-3-7-11-20/h2-15,22-23,27H,16-17H2,1H3,(H,26,28)/t23-/m0/s1
NCI pathway
Reactome pathway
n/an/a 19n/an/an/an/an/an/a
Universit£ degli Studi di Napoli Federico II
Curated by ChEMBL
Assay Description
Inhibition of MDM2 in human U87MG cells assessed as reduction in MDM2 interaction with p53 after 10 mins by quantitative sandwich immune-enzymatic as...
J Med Chem 60: 8115-8130 (2017)
Article DOI: 10.1021/acs.jmedchem.7b00912
BindingDB Entry DOI: 10.7270/Q2348NJ0
p53-Binding Protein HDMX
(Homo sapiens (Human))
BDBM50241626
(CHEMBL4080951)
Show SMILES COC(=O)[C@H](Cc1ccc(O)cc1)NC(=O)CC(c1ccccc1)c1ccccc1 |r|
Show InChI InChI=1S/C25H25NO4/c1-30-25(29)23(16-18-12-14-21(27)15-13-18)26-24(28)17-22(19-8-4-2-5-9-19)20-10-6-3-7-11-20/h2-15,22-23,27H,16-17H2,1H3,(H,26,28)/t23-/m0/s1
NCI pathway
n/an/a 23n/an/an/an/an/an/a
Universit£ degli Studi di Napoli Federico II
Curated by ChEMBL
Assay Description
Inhibition of MDM4 in human SH-SY5Y cells assessed as reduction in MDM4 interaction with p53 after 10 mins by quantitative sandwich immune-enzymatic ...
J Med Chem 60: 8115-8130 (2017)
Article DOI: 10.1021/acs.jmedchem.7b00912
BindingDB Entry DOI: 10.7270/Q2348NJ0