BDBM50241662 CHEMBL4104741
SMILES: CN(C)[C@H]1CN(C[C@@H]1c1ccc(cc1)N1CCN(CC1)S(C)(=O)=O)C1CCc2cccc(F)c12
InChI Key: InChIKey=REVJNSVNICWODC-KIDMSAQOSA-N
Data: 1 KI  1 IC50  1 Kd
Activity Spreadsheet -- Enzyme Inhibition Constant Data from BindingDB
Found 5 hits for monomerid = 50241662
Trg + Lig
Ki
nM
ΔG°
kcal/mole
IC50
nM
Kd
nM
EC50/IC50
nM
koff
s-1
kon
M-1s-1
pHTemp
°C
Polycomb protein EED
(Homo sapiens (Human))
BDBM50241662
(CHEMBL4104741)
Show SMILES CN(C)[C@H]1CN(C[C@@H]1c1ccc(cc1)N1CCN(CC1)S(C)(=O)=O)C1CCc2cccc(F)c12 |r|
Show InChI InChI=1S/C26H35FN4O2S/c1-28(2)25-18-30(24-12-9-20-5-4-6-23(27)26(20)24)17-22(25)19-7-10-21(11-8-19)29-13-15-31(16-14-29)34(3,32)33/h4-8,10-11,22,24-25H,9,12-18H2,1-3H3/t22-,24?,25+/m1/s1
0.300n/an/an/an/an/an/an/an/a
AbbVie Inc.
Curated by ChEMBL
Assay Description
Binding affinity to GST tagged EED (unknown origin) after 1 hr by OG(488) probe based TR-FRET assay
J Med Chem 60: 8321-8335 (2017)
Article DOI: 10.1021/acs.jmedchem.7b00576
BindingDB Entry DOI: 10.7270/Q2TM7D8G
Polycomb protein EED
(Homo sapiens (Human))
BDBM50241662
(CHEMBL4104741)
Show SMILES CN(C)[C@H]1CN(C[C@@H]1c1ccc(cc1)N1CCN(CC1)S(C)(=O)=O)C1CCc2cccc(F)c12 |r|
Show InChI InChI=1S/C26H35FN4O2S/c1-28(2)25-18-30(24-12-9-20-5-4-6-23(27)26(20)24)17-22(25)19-7-10-21(11-8-19)29-13-15-31(16-14-29)34(3,32)33/h4-8,10-11,22,24-25H,9,12-18H2,1-3H3/t22-,24?,25+/m1/s1
0.310n/an/an/an/an/an/an/an/a
TBA
Citation and Details
Polycomb protein EED
(Homo sapiens (Human))
BDBM50241662
(CHEMBL4104741)
Show SMILES CN(C)[C@H]1CN(C[C@@H]1c1ccc(cc1)N1CCN(CC1)S(C)(=O)=O)C1CCc2cccc(F)c12 |r|
Show InChI InChI=1S/C26H35FN4O2S/c1-28(2)25-18-30(24-12-9-20-5-4-6-23(27)26(20)24)17-22(25)19-7-10-21(11-8-19)29-13-15-31(16-14-29)34(3,32)33/h4-8,10-11,22,24-25H,9,12-18H2,1-3H3/t22-,24?,25+/m1/s1
n/an/an/a 1.5n/an/an/an/an/a
TBA
Citation and Details
Polycomb protein EED
(Homo sapiens (Human))
BDBM50241662
(CHEMBL4104741)
Show SMILES CN(C)[C@H]1CN(C[C@@H]1c1ccc(cc1)N1CCN(CC1)S(C)(=O)=O)C1CCc2cccc(F)c12 |r|
Show InChI InChI=1S/C26H35FN4O2S/c1-28(2)25-18-30(24-12-9-20-5-4-6-23(27)26(20)24)17-22(25)19-7-10-21(11-8-19)29-13-15-31(16-14-29)34(3,32)33/h4-8,10-11,22,24-25H,9,12-18H2,1-3H3/t22-,24?,25+/m1/s1
n/an/an/a 2n/an/an/an/an/a
AbbVie Inc.
Curated by ChEMBL
Assay Description
Inhibition of ADP-induced platelet aggregation in human platelet-rich plasma
J Med Chem 60: 8321-8335 (2017)
Article DOI: 10.1021/acs.jmedchem.7b00576
BindingDB Entry DOI: 10.7270/Q2TM7D8G
Polycomb protein EED
(Homo sapiens (Human))
BDBM50241662
(CHEMBL4104741)
Show SMILES CN(C)[C@H]1CN(C[C@@H]1c1ccc(cc1)N1CCN(CC1)S(C)(=O)=O)C1CCc2cccc(F)c12 |r|
Show InChI InChI=1S/C26H35FN4O2S/c1-28(2)25-18-30(24-12-9-20-5-4-6-23(27)26(20)24)17-22(25)19-7-10-21(11-8-19)29-13-15-31(16-14-29)34(3,32)33/h4-8,10-11,22,24-25H,9,12-18H2,1-3H3/t22-,24?,25+/m1/s1
n/an/a 7n/an/an/an/an/an/a
University of Connecticut
Curated by ChEMBL
Assay Description
Inhibition of GST-tagged EED (unknown origin) after 1 hr by OG(488) as probe-based TR-FRET analysis
Eur J Med Chem 136: 14-35 (2017)
Article DOI: 10.1016/j.ejmech.2017.04.047
BindingDB Entry DOI: 10.7270/Q2F76G3G