null
SMILES: Cl.NCC1OB(O)c2c1c(Cl)ccc2Oc1ccccc1
InChI Key: InChIKey=IYPQYWSMWLJPPE-UHFFFAOYSA-N
Activity Spreadsheet -- Enzyme Inhibition Constant Data from BindingDB
Found 1 hit for monomerid = 50241761
Trg + Lig
Ki
nM
ΔG°
kcal/mole
IC50
nM
Kd
nM
EC50/IC50
nM
koff
s-1
kon
M-1s-1
pHTemp
°C
Leucine--tRNA ligase
(Mycobacterium tuberculosis (strain ATCC 25618 / H3...)
BDBM50241761
(CHEMBL4089141)
Show SMILES Cl.NCC1OB(O)c2c1c(Cl)ccc2Oc1ccccc1
Show InChI InChI=1S/C14H13BClNO3.ClH/c16-10-6-7-11(19-9-4-2-1-3-5-9)14-13(10)12(8-17)20-15(14)18;/h1-7,12,18H,8,17H2;1H
n/an/a 340n/an/an/an/an/an/a
Anacor Pharmaceuticals, Inc.
Curated by ChEMBL
Assay Description
Binding affinity against sigma receptor from guinea pig brain, using [3H](+)-pentazocine as radioligand.
J Med Chem 60: 8011-8026 (2017)
Article DOI: 10.1021/acs.jmedchem.7b00631
BindingDB Entry DOI: 10.7270/Q2XD13TH