BDBM50241775 CHEMBL4078760
SMILES: Cl.CCOc1cc2B(O)OC(CN)c2c(Br)c1
InChI Key: InChIKey=IUEUKJZGCINLAP-UHFFFAOYSA-N
Data: 1 IC50
Activity Spreadsheet -- Enzyme Inhibition Constant Data from BindingDB
Found 1 hit for monomerid = 50241775
Trg + Lig
Ki
nM
ΔG°
kcal/mole
IC50
nM
Kd
nM
EC50/IC50
nM
koff
s-1
kon
M-1s-1
pHTemp
°C
Leucine--tRNA ligase
(Mycobacterium tuberculosis (strain ATCC 25618 / H3...)
BDBM50241775
(CHEMBL4078760)
Show SMILES Cl.CCOc1cc2B(O)OC(CN)c2c(Br)c1
Show InChI InChI=1S/C10H13BBrNO3.ClH/c1-2-15-6-3-7-10(8(12)4-6)9(5-13)16-11(7)14;/h3-4,9,14H,2,5,13H2,1H3;1H
n/an/a 260n/an/an/an/an/an/a
Anacor Pharmaceuticals, Inc.
Curated by ChEMBL
Assay Description
Inhibition of Mycobacterium tuberculosis H37Rv N-terminal 6His-tagged LeuRS expressed in Escherichia coli BL21(DE3) assessed as L-[14C]leucine incorp...
J Med Chem 60: 8011-8026 (2017)
Article DOI: 10.1021/acs.jmedchem.7b00631
BindingDB Entry DOI: 10.7270/Q2XD13TH