BDBM50241793 CHEMBL4066921
SMILES: Cl.CCCCOc1ccc(Cl)c2[C@@H](CN)OB(O)c12
InChI Key: InChIKey=VNEALUQKKBDJRV-HNCPQSOCSA-N
Data: 1 IC50
Activity Spreadsheet -- Enzyme Inhibition Constant Data from BindingDB
Found 1 hit for monomerid = 50241793
Trg + Lig
Ki
nM
ΔG°
kcal/mole
IC50
nM
Kd
nM
EC50/IC50
nM
koff
s-1
kon
M-1s-1
pHTemp
°C
Leucine--tRNA ligase
(Mycobacterium tuberculosis (strain ATCC 25618 / H3...)
BDBM50241793
(CHEMBL4066921)
Show SMILES Cl.CCCCOc1ccc(Cl)c2[C@@H](CN)OB(O)c12 |r|
Show InChI InChI=1S/C12H17BClNO3.ClH/c1-2-3-6-17-9-5-4-8(14)11-10(7-15)18-13(16)12(9)11;/h4-5,10,16H,2-3,6-7,15H2,1H3;1H/t10-;/m1./s1
n/an/a 270n/an/an/an/an/an/a
Anacor Pharmaceuticals, Inc.
Curated by ChEMBL
Assay Description
Inhibition of Mycobacterium tuberculosis H37Rv N-terminal 6His-tagged LeuRS expressed in Escherichia coli BL21(DE3) assessed as L-[14C]leucine incorp...
J Med Chem 60: 8011-8026 (2017)
Article DOI: 10.1021/acs.jmedchem.7b00631
BindingDB Entry DOI: 10.7270/Q2XD13TH