BDBM50241820 4'-hydroxy-5,7-dimethoxyisoflavone::CHEMBL445815
SMILES: COc1cc(OC)c2c(c1)occ(-c1ccc(O)cc1)c2=O
InChI Key: InChIKey=YZBVKMUAJDLNMZ-UHFFFAOYSA-N
Data: 1 IC50
Activity Spreadsheet -- Enzyme Inhibition Constant Data from BindingDB
Found 1 hit for monomerid = 50241820
Trg + Lig
Ki
nM
ΔG°
kcal/mole
IC50
nM
Kd
nM
EC50/IC50
nM
koff
s-1
kon
M-1s-1
pHTemp
°C
Protein-tyrosine phosphatase 1B
(Homo sapiens (Human))
BDBM50241820
(4'-hydroxy-5,7-dimethoxyisoflavone | CHEMBL445815)
Show SMILES COc1cc(OC)c2c(c1)occ(-c1ccc(O)cc1)c2=O
Show InChI InChI=1S/C17H14O5/c1-20-12-7-14(21-2)16-15(8-12)22-9-13(17(16)19)10-3-5-11(18)6-4-10/h3-9,18H,1-2H3
NCI pathway
Reactome pathway
n/an/a>6.00E+4n/an/an/an/an/an/a
Korea Research Institute of Bioscience and Biotechnology
Curated by ChEMBL
Assay Description
Inhibition of human recombinant PTP1B
J Nat Prod 69: 1572-6 (2006)
Article DOI: 10.1021/np0601861
BindingDB Entry DOI: 10.7270/Q2B8591J