BDBM50241986 Bastadin-10::CHEMBL504851
SMILES: O[C@@H]1CNC(=O)C(Cc2cc(Br)c(O)c(Oc3ccc(CC(N=O)C(=O)NCCc4cc(Br)c(O)c(Oc5ccc1cc5Br)c4)cc3Br)c2)N=O
InChI Key: InChIKey=JKNAJJISQXNPQP-NRUKRLKBSA-N
Data: 1 EC50
Activity Spreadsheet -- Enzyme Inhibition Constant Data from BindingDB
Found 1 hit for monomerid = 50241986
Trg + Lig
Ki
nM
ΔG°
kcal/mole
IC50
nM
Kd
nM
EC50/IC50
nM
koff
s-1
kon
M-1s-1
pHTemp
°C
Ryanodine receptor 1
(Homo sapiens (Human))
BDBM50241986
(Bastadin-10 | CHEMBL504851)
Show SMILES O[C@@H]1CNC(=O)C(Cc2cc(Br)c(O)c(Oc3ccc(CC(N=O)C(=O)NCCc4cc(Br)c(O)c(Oc5ccc1cc5Br)c4)cc3Br)c2)N=O |r|
Show InChI InChI=1S/C34H28Br4N4O9/c35-20-7-16-1-3-27(20)50-30-13-18(9-23(38)32(30)45)11-25(42-49)34(47)40-15-26(43)19-2-4-28(21(36)14-19)51-29-12-17(8-22(37)31(29)44)5-6-39-33(46)24(10-16)41-48/h1-4,7-9,12-14,24-26,43-45H,5-6,10-11,15H2,(H,39,46)(H,40,47)/t24?,25?,26-/m1/s1
Reactome pathway
n/an/an/an/a 5.80E+3n/an/an/an/a
University of California
Curated by ChEMBL
Assay Description
Displacement of [3H]ryanodine from RyR1 calcium channel in sarcoplasmic reticulum assessed as calcium mobilization
J Nat Prod 66: 112-4 (2003)
Article DOI: 10.1021/np020382h
BindingDB Entry DOI: 10.7270/Q2HM587T