BDBM50242016 CHEMBL464007::broussoflavonol F
SMILES: [#6]\[#6](-[#6])=[#6]\[#6]-c1cc(ccc1-[#8])-c1oc2c(-[#6]\[#6]=[#6](\[#6])-[#6])c(-[#8])cc(-[#8])c2c(=O)c1-[#8]
InChI Key: InChIKey=KNMMNUQOUANAJS-UHFFFAOYSA-N
Data: 1 IC50
Activity Spreadsheet -- Enzyme Inhibition Constant Data from BindingDB
Found 1 hit for monomerid = 50242016
Trg + Lig
Ki
nM
ΔG°
kcal/mole
IC50
nM
Kd
nM
EC50/IC50
nM
koff
s-1
kon
M-1s-1
pHTemp
°C
Cytochrome P450 19A1
(Homo sapiens (Human))
BDBM50242016
(CHEMBL464007 | broussoflavonol F)
Show SMILES [#6]\[#6](-[#6])=[#6]\[#6]-c1cc(ccc1-[#8])-c1oc2c(-[#6]\[#6]=[#6](\[#6])-[#6])c(-[#8])cc(-[#8])c2c(=O)c1-[#8]
Show InChI InChI=1S/C25H26O6/c1-13(2)5-7-15-11-16(8-10-18(15)26)24-23(30)22(29)21-20(28)12-19(27)17(25(21)31-24)9-6-14(3)4/h5-6,8,10-12,26-28,30H,7,9H2,1-4H3
Reactome pathway
n/an/a 9.70E+3n/an/an/an/an/an/a
University of Illinois at Chicago
Curated by ChEMBL
Assay Description
Inhibition of aromatase from human placental microsomes
J Nat Prod 64: 1286-93 (2001)
BindingDB Entry DOI: 10.7270/Q2RB74C4