BDBM50242071 2,5-Dideoxy-2,5-imino-D-glycero-D-manno-heptitol::2,5-dideoxy-2,5-imino-dl-glycero-D-manno-heptitol::CHEMBL456077
SMILES: OCC(O)[C@H]1N[C@H](CO)[C@@H](O)[C@@H]1O
InChI Key: InChIKey=ZJRUOSSQTZGFJV-UHEPRFFZSA-N
Data: 4 IC50
Activity Spreadsheet -- Enzyme Inhibition Constant Data from BindingDB
Found 4 hits for monomerid = 50242071
Trg + Lig
Ki
nM
ΔG°
kcal/mole
IC50
nM
Kd
nM
EC50/IC50
nM
koff
s-1
kon
M-1s-1
pHTemp
°C
Acidic alpha-glucosidase
(Rattus norvegicus)
BDBM50242071
(2,5-Dideoxy-2,5-imino-D-glycero-D-manno-heptitol |...)
Show SMILES OCC(O)[C@H]1N[C@H](CO)[C@@H](O)[C@@H]1O |r|
Show InChI InChI=1S/C7H15NO5/c9-1-3-6(12)7(13)5(8-3)4(11)2-10/h3-13H,1-2H2/t3-,4?,5-,6-,7-/m1/s1
n/an/a 4.00E+5n/an/an/an/an/an/a
Hokuriku University
Curated by ChEMBL
Assay Description
Inhibition of Wistar rat intestinal maltase
J Nat Prod 61: 625-8 (1998)
Article DOI: 10.1021/np9705726
BindingDB Entry DOI: 10.7270/Q2F47NXN
β-galactosidase
(Bos taurus (Bovine))
BDBM50242071
(2,5-Dideoxy-2,5-imino-D-glycero-D-manno-heptitol |...)
Show SMILES OCC(O)[C@H]1N[C@H](CO)[C@@H](O)[C@@H]1O |r|
Show InChI InChI=1S/C7H15NO5/c9-1-3-6(12)7(13)5(8-3)4(11)2-10/h3-13H,1-2H2/t3-,4?,5-,6-,7-/m1/s1
n/an/a 4.40E+3n/an/an/an/an/an/a
Hokuriku University
Curated by ChEMBL
Assay Description
Inhibition of bovine liver beta-galactosidase by spectrophotometry
J Nat Prod 67: 846-50 (2004)
Article DOI: 10.1021/np0499721
BindingDB Entry DOI: 10.7270/Q2Q52PD8
Lactase-glycosylceramidase
(Rattus norvegicus)
BDBM50242071
(2,5-Dideoxy-2,5-imino-D-glycero-D-manno-heptitol |...)
Show SMILES OCC(O)[C@H]1N[C@H](CO)[C@@H](O)[C@@H]1O |r|
Show InChI InChI=1S/C7H15NO5/c9-1-3-6(12)7(13)5(8-3)4(11)2-10/h3-13H,1-2H2/t3-,4?,5-,6-,7-/m1/s1
n/an/a 4.00E+3n/an/an/an/an/an/a
Hokuriku University
Curated by ChEMBL
Assay Description
Inhibition of Wistar rat intestinal lactase
J Nat Prod 61: 625-8 (1998)
Article DOI: 10.1021/np9705726
BindingDB Entry DOI: 10.7270/Q2F47NXN
alpha-Glucosidase (α-Glucosidase)
(Rattus norvegicus (Rat))
BDBM50242071
(2,5-Dideoxy-2,5-imino-D-glycero-D-manno-heptitol |...)
Show SMILES OCC(O)[C@H]1N[C@H](CO)[C@@H](O)[C@@H]1O |r|
Show InChI InChI=1S/C7H15NO5/c9-1-3-6(12)7(13)5(8-3)4(11)2-10/h3-13H,1-2H2/t3-,4?,5-,6-,7-/m1/s1
n/an/a 3.00E+5n/an/an/an/an/an/a
Hokuriku University
Curated by ChEMBL
Assay Description
Inhibition of Wistar rat intestinal sucrase
J Nat Prod 61: 625-8 (1998)
Article DOI: 10.1021/np9705726
BindingDB Entry DOI: 10.7270/Q2F47NXN