BDBM50242128 CHEMBL511822::Taraxerol, 8::taraxerol
SMILES: CC1(C)CC[C@]2(C)CC=C3[C@]4(C)CC[C@H]5C(C)(C)[C@@H](O)CC[C@]5(C)[C@H]4CC[C@@]3(C)[C@@H]2C1
InChI Key: InChIKey=GGGUGZHBAOMSFJ-GADYQYKKSA-N
Data: 2 IC50
Activity Spreadsheet -- Enzyme Inhibition Constant Data from BindingDB
Found 2 hits for monomerid = 50242128
Trg + Lig
Ki
nM
ΔG°
kcal/mole
IC50
nM
Kd
nM
EC50/IC50
nM
koff
s-1
kon
M-1s-1
pHTemp
°C
Nitric Oxide Synthase, inducible
(Mus musculus (mouse))
BDBM50242128
(CHEMBL511822 | Taraxerol, 8 | taraxerol)
Show SMILES CC1(C)CC[C@]2(C)CC=C3[C@]4(C)CC[C@H]5C(C)(C)[C@@H](O)CC[C@]5(C)[C@H]4CC[C@@]3(C)[C@@H]2C1 |r,t:8|
Show InChI InChI=1S/C30H50O/c1-25(2)17-18-27(5)13-9-21-29(7)14-10-20-26(3,4)24(31)12-16-28(20,6)22(29)11-15-30(21,8)23(27)19-25/h9,20,22-24,31H,10-19H2,1-8H3/t20-,22+,23+,24-,27-,28-,29-,30+/m0/s1
Reactome pathway
n/an/a 2.42E+4n/an/an/an/an/an/a
National Cheng Kung University
Curated by ChEMBL
Assay Description
Inhibition of iNOS-mediated NO production in LPS-induced mouse BV2 cells
Bioorg Med Chem 16: 9867-70 (2008)
Article DOI: 10.1016/j.bmc.2008.09.021
BindingDB Entry DOI: 10.7270/Q2125TK2
Ghrelin O-acyltransferase
(Homo sapiens (Human))
BDBM50242128
(CHEMBL511822 | Taraxerol, 8 | taraxerol)
Show SMILES CC1(C)CC[C@]2(C)CC=C3[C@]4(C)CC[C@H]5C(C)(C)[C@@H](O)CC[C@]5(C)[C@H]4CC[C@@]3(C)[C@@H]2C1 |r,t:8|
Show InChI InChI=1S/C30H50O/c1-25(2)17-18-27(5)13-9-21-29(7)14-10-20-26(3,4)24(31)12-16-28(20,6)22(29)11-15-30(21,8)23(27)19-25/h9,20,22-24,31H,10-19H2,1-8H3/t20-,22+,23+,24-,27-,28-,29-,30+/m0/s1
n/an/a>1.00E+5n/an/an/an/a7.025
Syracuse University
Assay Description
Assays were performed with ~100 μg of membrane protein, as determined by a Bradford assay. The membrane fraction was preincubated with 1 μM met...
Biochemistry 56: 919-931 (2017)
Article DOI: 10.1021/acs.biochem.6b01008
BindingDB Entry DOI: 10.7270/Q270808D