BDBM50242377 CHEMBL448060::isoimperatorin
SMILES: [#6]\[#6](-[#6])=[#6]\[#6]-[#8]-c1c2ccoc2cc2oc(=O)ccc12
InChI Key: InChIKey=IGWDEVSBEKYORK-UHFFFAOYSA-N
Data: 1 KI  7 IC50
Activity Spreadsheet -- Enzyme Inhibition Constant Data from BindingDB
Found 8 hits for monomerid = 50242377
Trg + Lig
Ki
nM
ΔG°
kcal/mole
IC50
nM
Kd
nM
EC50/IC50
nM
koff
s-1
kon
M-1s-1
pHTemp
°C
Cytochrome P450 1B1
(Homo sapiens (Human))
BDBM50242377
(CHEMBL448060 | isoimperatorin)
Show SMILES [#6]\[#6](-[#6])=[#6]\[#6]-[#8]-c1c2ccoc2cc2oc(=O)ccc12
Show InChI InChI=1S/C16H14O4/c1-10(2)5-7-19-16-11-3-4-15(17)20-14(11)9-13-12(16)6-8-18-13/h3-6,8-9H,7H2,1-2H3
Reactome pathway
6.00E+3n/an/an/an/an/an/an/an/a
Laboratory of Medicinal Chemistry, Endocrinology and Nephrology Unit, CHU de Québec - Research Center, Québec, Québec, Canada; Department of Molecular Medicine, Faculty of Medicine, Université Laval,
Curated by ChEMBL
Assay Description
Competitive inhibition of CYP1B1 (unknown origin) expressed in yeast microsomes using (-)benzo[a]pyrene-7R-trans-7,8-dihyrodiol (B[a]P-7,8-diol) as s...
Eur J Med Chem 135: 296-306 (2017)
Article DOI: 10.1016/j.ejmech.2017.04.042
BindingDB Entry DOI: 10.7270/Q26Q20QW
Beta-secretase 1
(Homo sapiens (Human))
BDBM50242377
(CHEMBL448060 | isoimperatorin)
Show SMILES [#6]\[#6](-[#6])=[#6]\[#6]-[#8]-c1c2ccoc2cc2oc(=O)ccc12
Show InChI InChI=1S/C16H14O4/c1-10(2)5-7-19-16-11-3-4-15(17)20-14(11)9-13-12(16)6-8-18-13/h3-6,8-9H,7H2,1-2H3
n/an/a 2.44E+5n/an/an/an/an/an/a
Kinki University
Curated by ChEMBL
Assay Description
Inhibition of recombinant human BACE1 using Rh-EVNLDAEFK as substrate after 60 mins by fluorescence quenching assay
Bioorg Med Chem 20: 784-8 (2012)
Article DOI: 10.1016/j.bmc.2011.12.002
BindingDB Entry DOI: 10.7270/Q2F47PKK
Butyrylcholinesterase (BuChE)
(Equus caballus (Horse))
BDBM50242377
(CHEMBL448060 | isoimperatorin)
Show SMILES [#6]\[#6](-[#6])=[#6]\[#6]-[#8]-c1c2ccoc2cc2oc(=O)ccc12
Show InChI InChI=1S/C16H14O4/c1-10(2)5-7-19-16-11-3-4-15(17)20-14(11)9-13-12(16)6-8-18-13/h3-6,8-9H,7H2,1-2H3
n/an/a 2.31E+4n/an/an/an/an/an/a
Ramkhamhaeng University
Curated by ChEMBL
Assay Description
Inhibition of horse serum BChE after 2 mins by Ellman's reaction
J Nat Prod 73: 1879-83 (2010)
Article DOI: 10.1021/np100531x
BindingDB Entry DOI: 10.7270/Q2PV6KN8
Amine oxidase (flavin-containing) A
(Homo sapiens (Human))
BDBM50242377
(CHEMBL448060 | isoimperatorin)
Show SMILES [#6]\[#6](-[#6])=[#6]\[#6]-[#8]-c1c2ccoc2cc2oc(=O)ccc12
Show InChI InChI=1S/C16H14O4/c1-10(2)5-7-19-16-11-3-4-15(17)20-14(11)9-13-12(16)6-8-18-13/h3-6,8-9H,7H2,1-2H3
n/an/a>2.00E+4n/an/an/an/an/an/a
Sunchon National University
Curated by ChEMBL
Assay Description
Inhibition of human recombinant MAO-A expressed in baculovirus infected BTI insect cells using kynuramine as substrate after 20 mins by spectrophotom...
Bioorg Med Chem Lett 29: 839-843 (2019)
Article DOI: 10.1016/j.bmcl.2019.01.016
Acetylcholinesterase
(Electrophorus electricus (Electric eel))
BDBM50242377
(CHEMBL448060 | isoimperatorin)
Show SMILES [#6]\[#6](-[#6])=[#6]\[#6]-[#8]-c1c2ccoc2cc2oc(=O)ccc12
Show InChI InChI=1S/C16H14O4/c1-10(2)5-7-19-16-11-3-4-15(17)20-14(11)9-13-12(16)6-8-18-13/h3-6,8-9H,7H2,1-2H3
n/an/a 2.56E+4n/an/an/an/an/an/a
Sunchon National University
Curated by ChEMBL
Assay Description
Inhibition of electric eel AChE using acetylthiocholine iodide as substrate preincubated for 15 mins followed by substrate addition by Ellman's metho...
Bioorg Med Chem Lett 29: 839-843 (2019)
Article DOI: 10.1016/j.bmcl.2019.01.016
Amine oxidase [flavin-containing] B
(Homo sapiens (Human))
BDBM50242377
(CHEMBL448060 | isoimperatorin)
Show SMILES [#6]\[#6](-[#6])=[#6]\[#6]-[#8]-c1c2ccoc2cc2oc(=O)ccc12
Show InChI InChI=1S/C16H14O4/c1-10(2)5-7-19-16-11-3-4-15(17)20-14(11)9-13-12(16)6-8-18-13/h3-6,8-9H,7H2,1-2H3
n/an/a>6.00E+4n/an/an/an/an/an/a
Sunchon National University
Curated by ChEMBL
Assay Description
Inhibition of human recombinant MAO-B expressed in baculovirus infected BTI insect cells using benzylamine as substrate after 30 mins by spectrophoto...
Bioorg Med Chem Lett 29: 839-843 (2019)
Article DOI: 10.1016/j.bmcl.2019.01.016
Beta-secretase 1
(Homo sapiens (Human))
BDBM50242377
(CHEMBL448060 | isoimperatorin)
Show SMILES [#6]\[#6](-[#6])=[#6]\[#6]-[#8]-c1c2ccoc2cc2oc(=O)ccc12
Show InChI InChI=1S/C16H14O4/c1-10(2)5-7-19-16-11-3-4-15(17)20-14(11)9-13-12(16)6-8-18-13/h3-6,8-9H,7H2,1-2H3
n/an/a 2.44E+5n/an/an/an/an/an/a
Kinki University
Curated by ChEMBL
Assay Description
Inhibition of human recombinant BACE1 after 60 mins by fluorescence assay
Bioorg Med Chem 18: 455-9 (2010)
Article DOI: 10.1016/j.bmc.2009.10.004
BindingDB Entry DOI: 10.7270/Q2K64J6S
Acetylcholinesterase
(Homo sapiens (Human))
BDBM50242377
(CHEMBL448060 | isoimperatorin)
Show SMILES [#6]\[#6](-[#6])=[#6]\[#6]-[#8]-c1c2ccoc2cc2oc(=O)ccc12
Show InChI InChI=1S/C16H14O4/c1-10(2)5-7-19-16-11-3-4-15(17)20-14(11)9-13-12(16)6-8-18-13/h3-6,8-9H,7H2,1-2H3
NCI pathway
Reactome pathway
n/an/a 6.90E+4n/an/an/an/an/an/a
Seoul National University
Curated by ChEMBL
Assay Description
Inhibition of AChE by spectrophotometry
J Nat Prod 64: 683-5 (2001)
BindingDB Entry DOI: 10.7270/Q29G5NQD