BDBM50242497 (2S,4S)-4-Fluoro-1-[N-(3-isopropoxypropyl)glycyl]pyrrolidine-2-carbonitrile::CHEMBL469452
SMILES: CC(C)OCCCNCC(=O)N1C[C@@H](F)C[C@H]1C#N
InChI Key: InChIKey=GPHQDWFPIRKLNQ-RYUDHWBXSA-N
Data: 1 IC50
Activity Spreadsheet -- Enzyme Inhibition Constant Data from BindingDB
Found 1 hit for monomerid = 50242497
Trg + Lig
Ki
nM
ΔG°
kcal/mole
IC50
nM
Kd
nM
EC50/IC50
nM
koff
s-1
kon
M-1s-1
pHTemp
°C
Dipeptidyl peptidase 4
(Homo sapiens (Human))
BDBM50242497
((2S,4S)-4-Fluoro-1-[N-(3-isopropoxypropyl)glycyl]p...)
Show SMILES CC(C)OCCCNCC(=O)N1C[C@@H](F)C[C@H]1C#N |r|
Show InChI InChI=1S/C13H22FN3O2/c1-10(2)19-5-3-4-16-8-13(18)17-9-11(14)6-12(17)7-15/h10-12,16H,3-6,8-9H2,1-2H3/t11-,12-/m0/s1
Reactome pathway
n/an/a 8.70n/an/an/an/an/an/a
Taisho Pharmaceutical Co., Ltd
Curated by ChEMBL
Assay Description
Inhibition of DPP4 in human plasma by fluorescence assay
Bioorg Med Chem 16: 4093-106 (2008)
Article DOI: 10.1016/j.bmc.2008.01.016
BindingDB Entry DOI: 10.7270/Q27H1KGN