null
SMILES: O=c1sc2cc(ccc2n1Cc1ccccc1)S(=O)(=O)Nc1ncns1
InChI Key: InChIKey=GTHCYFOABKSWFV-UHFFFAOYSA-N
Activity Spreadsheet -- Enzyme Inhibition Constant Data from BindingDB
Found 2 hits for monomerid = 50242511
Trg + Lig
Ki
nM
ΔG°
kcal/mole
IC50
nM
Kd
nM
EC50/IC50
nM
koff
s-1
kon
M-1s-1
pHTemp
°C
Sodium channel protein type 9 subunit alpha
(Homo sapiens (Human))
BDBM50242511
(CHEMBL4071639)
Show SMILES O=c1sc2cc(ccc2n1Cc1ccccc1)S(=O)(=O)Nc1ncns1
Show InChI InChI=1S/C16H12N4O3S3/c21-16-20(9-11-4-2-1-3-5-11)13-7-6-12(8-14(13)24-16)26(22,23)19-15-17-10-18-25-15/h1-8,10H,9H2,(H,17,18,19)
n/an/a 970n/an/an/an/an/an/a
Merck& Co.
Curated by ChEMBL
Assay Description
Inhibition of 50% inactivated human Nav1.7alpha expressed in HEK293 cells incubated for 5 mins measured at 10 secs interval by PatchXpress automated ...
Bioorg Med Chem Lett 27: 2683-2688 (2017)
Article DOI: 10.1016/j.bmcl.2017.04.040
BindingDB Entry DOI: 10.7270/Q2SN0CD7
Sodium channel protein type 5 subunit alpha
(Homo sapiens (Human))
BDBM50242511
(CHEMBL4071639)
Show SMILES O=c1sc2cc(ccc2n1Cc1ccccc1)S(=O)(=O)Nc1ncns1
Show InChI InChI=1S/C16H12N4O3S3/c21-16-20(9-11-4-2-1-3-5-11)13-7-6-12(8-14(13)24-16)26(22,23)19-15-17-10-18-25-15/h1-8,10H,9H2,(H,17,18,19)
n/an/a>3.00E+4n/an/an/an/an/an/a
Merck& Co.
Curated by ChEMBL
Assay Description
Inhibition of 50% inactivated human Nav1.5alpha expressed in HEK293 cells incubated for 5 mins measured at 10 secs interval by PatchXpress automated ...
Bioorg Med Chem Lett 27: 2683-2688 (2017)
Article DOI: 10.1016/j.bmcl.2017.04.040
BindingDB Entry DOI: 10.7270/Q2SN0CD7