BDBM50242517 (2S,4S)-1-(N-Cyclopentylglycyl)-4-fluoropyrrolidine-2-carbonitrile::CHEMBL470477
SMILES: F[C@H]1C[C@@H](C#N)N(C1)C(=O)CNC1CCCC1
InChI Key: InChIKey=HHDXFWACRSCMEH-ONGXEEELSA-N
Data: 1 IC50
Activity Spreadsheet -- Enzyme Inhibition Constant Data from BindingDB
Found 1 hit for monomerid = 50242517
Trg + Lig
Ki
nM
ΔG°
kcal/mole
IC50
nM
Kd
nM
EC50/IC50
nM
koff
s-1
kon
M-1s-1
pHTemp
°C
Dipeptidyl peptidase 4
(Homo sapiens (Human))
BDBM50242517
((2S,4S)-1-(N-Cyclopentylglycyl)-4-fluoropyrrolidin...)
Show SMILES F[C@H]1C[C@@H](C#N)N(C1)C(=O)CNC1CCCC1 |r|
Show InChI InChI=1S/C12H18FN3O/c13-9-5-11(6-14)16(8-9)12(17)7-15-10-3-1-2-4-10/h9-11,15H,1-5,7-8H2/t9-,11-/m0/s1
Reactome pathway
n/an/a 2.60n/an/an/an/an/an/a
Taisho Pharmaceutical Co., Ltd
Curated by ChEMBL
Assay Description
Inhibition of DPP4 in human plasma by fluorescence assay
Bioorg Med Chem 16: 4093-106 (2008)
Article DOI: 10.1016/j.bmc.2008.01.016
BindingDB Entry DOI: 10.7270/Q27H1KGN