null
SMILES:
InChI Key: InChIKey=GNOUIXMFVXQSID-PQJBAPHYSA-N
Activity Spreadsheet -- Enzyme Inhibition Constant Data from BindingDB
Found 1 hit for monomerid = 50242533
Trg + Lig
Ki
nM
ΔG°
kcal/mole
IC50
nM
Kd
nM
EC50/IC50
nM
koff
s-1
kon
M-1s-1
pHTemp
°C
Dipeptidyl peptidase 4
(Homo sapiens (Human))
BDBM50242533
((2S,4S)-4-Fluoro-1-[N-(5-hydroxy-2-adamantyl)-glyc...)
Show InChI InChI=1S/C17H24FN3O2/c18-13-3-14(7-19)21(9-13)15(22)8-20-16-11-1-10-2-12(16)6-17(23,4-10)5-11/h10-14,16,20,23H,1-6,8-9H2/t10?,11?,12?,13-,14-,16?,17?/m0/s1
Reactome pathway
n/an/a 5.30n/an/an/an/an/an/a
Taisho Pharmaceutical Co., Ltd
Curated by ChEMBL
Assay Description
Inhibition of DPP4 in human plasma by fluorescence assay
Bioorg Med Chem 16: 4093-106 (2008)
Article DOI: 10.1016/j.bmc.2008.01.016
BindingDB Entry DOI: 10.7270/Q27H1KGN