BDBM50242581 4-(Bis(4-chlorophenyl)methyl)-N-cyclohexylpiperazine-1-carboxamide::CHEMBL488420
SMILES: Clc1ccc(cc1)C(N1CCN(CC1)C(=O)NC1CCCCC1)c1ccc(Cl)cc1
InChI Key: InChIKey=OANLDZVRJDMUGO-UHFFFAOYSA-N
Data: 1 IC50
Activity Spreadsheet -- Enzyme Inhibition Constant Data from BindingDB
Found 1 hit for monomerid = 50242581
Trg + Lig
Ki
nM
ΔG°
kcal/mole
IC50
nM
Kd
nM
EC50/IC50
nM
koff
s-1
kon
M-1s-1
pHTemp
°C
Cannabinoid receptor 1
(Rattus norvegicus (rat))
BDBM50242581
(4-(Bis(4-chlorophenyl)methyl)-N-cyclohexylpiperazi...)
Show SMILES Clc1ccc(cc1)C(N1CCN(CC1)C(=O)NC1CCCCC1)c1ccc(Cl)cc1
Show InChI InChI=1S/C24H29Cl2N3O/c25-20-10-6-18(7-11-20)23(19-8-12-21(26)13-9-19)28-14-16-29(17-15-28)24(30)27-22-4-2-1-3-5-22/h6-13,22-23H,1-5,14-17H2,(H,27,30)
Reactome pathway
n/an/a 914n/an/an/an/an/an/a
Central Research Institute
Curated by ChEMBL
Assay Description
Displacement of [3H]CP55940 from CB1 receptor in Sprague-Dawley rat cerebella membrane
Bioorg Med Chem 16: 4035-51 (2008)
Article DOI: 10.1016/j.bmc.2008.01.023
BindingDB Entry DOI: 10.7270/Q2B56JH2