BDBM50242611 (S,4S)-4-Fluoro-1-{N-[2-(isobutylamino)-1,1-dimethylethyl]glycyl}pyrrolidine-2-carbonitrile::CHEMBL504237
SMILES: CC(C)CNCC(C)(C)NCC(=O)N1C[C@@H](F)C[C@H]1C#N
InChI Key: InChIKey=VUWZQJFITLFLHQ-STQMWFEESA-N
Data: 1 IC50
Activity Spreadsheet -- Enzyme Inhibition Constant Data from BindingDB
Found 1 hit for monomerid = 50242611
Trg + Lig
Ki
nM
ΔG°
kcal/mole
IC50
nM
Kd
nM
EC50/IC50
nM
koff
s-1
kon
M-1s-1
pHTemp
°C
Dipeptidyl peptidase 4
(Homo sapiens (Human))
BDBM50242611
((S,4S)-4-Fluoro-1-{N-[2-(isobutylamino)-1,1-dimeth...)
Show SMILES CC(C)CNCC(C)(C)NCC(=O)N1C[C@@H](F)C[C@H]1C#N |r|
Show InChI InChI=1S/C15H27FN4O/c1-11(2)7-18-10-15(3,4)19-8-14(21)20-9-12(16)5-13(20)6-17/h11-13,18-19H,5,7-10H2,1-4H3/t12-,13-/m0/s1
Reactome pathway
n/an/a>316n/an/an/an/an/an/a
Taisho Pharmaceutical Co., Ltd
Curated by ChEMBL
Assay Description
Inhibition of DPP4 in human plasma by fluorescence assay
Bioorg Med Chem 16: 4093-106 (2008)
Article DOI: 10.1016/j.bmc.2008.01.016
BindingDB Entry DOI: 10.7270/Q27H1KGN