BDBM50242925 1-{2-(3-Methylpiperazin-1-yl)-1-[3-(trifluoromethoxy)phenyl]ethyl}cyclohexanol Dihydrocholoride::CHEMBL469667
SMILES: CN1CCN(CC(c2cccc(OC(F)(F)F)c2)C2(O)CCCCC2)CC1
InChI Key: InChIKey=AKRIZMRTOCYSRB-UHFFFAOYSA-N
Data: 1 KI  1 IC50
Activity Spreadsheet -- Enzyme Inhibition Constant Data from BindingDB
Found 2 hits for monomerid = 50242925
Trg + Lig
Ki
nM
ΔG°
kcal/mole
IC50
nM
Kd
nM
EC50/IC50
nM
koff
s-1
kon
M-1s-1
pHTemp
°C
Sodium-dependent noradrenaline transporter
(Homo sapiens (Human))
BDBM50242925
(1-{2-(3-Methylpiperazin-1-yl)-1-[3-(trifluorometho...)
Show SMILES CN1CCN(CC(c2cccc(OC(F)(F)F)c2)C2(O)CCCCC2)CC1
Show InChI InChI=1S/C20H29F3N2O2/c1-24-10-12-25(13-11-24)15-18(19(26)8-3-2-4-9-19)16-6-5-7-17(14-16)27-20(21,22)23/h5-7,14,18,26H,2-4,8-13,15H2,1H3
Reactome pathway
91n/an/an/an/an/an/an/an/a
Wyeth Research
Curated by ChEMBL
Assay Description
Displacement of [3H]nisoxetine from human norepinephrine transporter expressed in MDCK-Net6 cells
J Med Chem 51: 4038-49 (2008)
Article DOI: 10.1021/jm8002262
BindingDB Entry DOI: 10.7270/Q2TB16PB
Sodium-dependent noradrenaline transporter
(Homo sapiens (Human))
BDBM50242925
(1-{2-(3-Methylpiperazin-1-yl)-1-[3-(trifluorometho...)
Show SMILES CN1CCN(CC(c2cccc(OC(F)(F)F)c2)C2(O)CCCCC2)CC1
Show InChI InChI=1S/C20H29F3N2O2/c1-24-10-12-25(13-11-24)15-18(19(26)8-3-2-4-9-19)16-6-5-7-17(14-16)27-20(21,22)23/h5-7,14,18,26H,2-4,8-13,15H2,1H3
Reactome pathway
n/an/a 147n/an/an/an/an/an/a
Wyeth Research
Curated by ChEMBL
Assay Description
Inhibition of norepinephrine uptake at human norepinephrine transporter expressed in MDCK-Net6 cells
J Med Chem 51: 4038-49 (2008)
Article DOI: 10.1021/jm8002262
BindingDB Entry DOI: 10.7270/Q2TB16PB