BDBM50242927 (-)-1-{(1S)-2-(4-Methylpiperazin-1-yl)-1-[3-(trifluoromethoxy)phenyl]ethyl}cyclohexanol Dihydrocholoride::CHEMBL469668
SMILES: CN1CCN(C[C@H](c2cccc(OC(F)(F)F)c2)C2(O)CCCCC2)CC1
InChI Key: InChIKey=AKRIZMRTOCYSRB-GOSISDBHSA-N
Data: 1 KI  7 IC50  6 EC50
Activity Spreadsheet -- Enzyme Inhibition Constant Data from BindingDB
Found 14 hits for monomerid = 50242927
Trg + Lig
Ki
nM
ΔG°
kcal/mole
IC50
nM
Kd
nM
EC50/IC50
nM
koff
s-1
kon
M-1s-1
pHTemp
°C
Sodium-dependent noradrenaline transporter
(Homo sapiens (Human))
BDBM50242927
((-)-1-{(1S)-2-(4-Methylpiperazin-1-yl)-1-[3-(trifl...)
Show SMILES CN1CCN(C[C@H](c2cccc(OC(F)(F)F)c2)C2(O)CCCCC2)CC1 |r|
Show InChI InChI=1S/C20H29F3N2O2/c1-24-10-12-25(13-11-24)15-18(19(26)8-3-2-4-9-19)16-6-5-7-17(14-16)27-20(21,22)23/h5-7,14,18,26H,2-4,8-13,15H2,1H3/t18-/m1/s1
Reactome pathway
50n/an/an/an/an/an/an/an/a
Wyeth Research
Curated by ChEMBL
Assay Description
Displacement of [3H]nisoxetine from human norepinephrine transporter expressed in MDCK-Net6 cells
J Med Chem 51: 4038-49 (2008)
Article DOI: 10.1021/jm8002262
BindingDB Entry DOI: 10.7270/Q2TB16PB
5-hydroxytryptamine receptor 1B
(Homo sapiens (Human))
BDBM50242927
((-)-1-{(1S)-2-(4-Methylpiperazin-1-yl)-1-[3-(trifl...)
Show SMILES CN1CCN(C[C@H](c2cccc(OC(F)(F)F)c2)C2(O)CCCCC2)CC1 |r|
Show InChI InChI=1S/C20H29F3N2O2/c1-24-10-12-25(13-11-24)15-18(19(26)8-3-2-4-9-19)16-6-5-7-17(14-16)27-20(21,22)23/h5-7,14,18,26H,2-4,8-13,15H2,1H3/t18-/m1/s1
Reactome pathway
n/an/an/an/a>1.00E+4n/an/an/an/a
Wyeth Research
Curated by ChEMBL
Assay Description
Activity at 5HT1B receptor (unknown origin) assessed as calcium mobilization by FLIPR
J Med Chem 51: 4038-49 (2008)
Article DOI: 10.1021/jm8002262
BindingDB Entry DOI: 10.7270/Q2TB16PB
5-hydroxytryptamine receptor 1B
(Homo sapiens (Human))
BDBM50242927
((-)-1-{(1S)-2-(4-Methylpiperazin-1-yl)-1-[3-(trifl...)
Show SMILES CN1CCN(C[C@H](c2cccc(OC(F)(F)F)c2)C2(O)CCCCC2)CC1 |r|
Show InChI InChI=1S/C20H29F3N2O2/c1-24-10-12-25(13-11-24)15-18(19(26)8-3-2-4-9-19)16-6-5-7-17(14-16)27-20(21,22)23/h5-7,14,18,26H,2-4,8-13,15H2,1H3/t18-/m1/s1
Reactome pathway
n/an/a>1.00E+4n/an/an/an/an/an/a
Wyeth Research
Curated by ChEMBL
Assay Description
Inhibition of 5HT1B receptor (unknown origin) by competition radioligand binding assay
J Med Chem 51: 4038-49 (2008)
Article DOI: 10.1021/jm8002262
BindingDB Entry DOI: 10.7270/Q2TB16PB
5-hydroxytryptamine receptor 1D
(Homo sapiens (Human))
BDBM50242927
((-)-1-{(1S)-2-(4-Methylpiperazin-1-yl)-1-[3-(trifl...)
Show SMILES CN1CCN(C[C@H](c2cccc(OC(F)(F)F)c2)C2(O)CCCCC2)CC1 |r|
Show InChI InChI=1S/C20H29F3N2O2/c1-24-10-12-25(13-11-24)15-18(19(26)8-3-2-4-9-19)16-6-5-7-17(14-16)27-20(21,22)23/h5-7,14,18,26H,2-4,8-13,15H2,1H3/t18-/m1/s1
Reactome pathway
n/an/a>1.00E+4n/an/an/an/an/an/a
Wyeth Research
Curated by ChEMBL
Assay Description
Inhibition of 5HT1D receptor (unknown origin) by competition radioligand binding assay
J Med Chem 51: 4038-49 (2008)
Article DOI: 10.1021/jm8002262
BindingDB Entry DOI: 10.7270/Q2TB16PB
5-hydroxytryptamine receptor 2A
(Homo sapiens (Human))
BDBM50242927
((-)-1-{(1S)-2-(4-Methylpiperazin-1-yl)-1-[3-(trifl...)
Show SMILES CN1CCN(C[C@H](c2cccc(OC(F)(F)F)c2)C2(O)CCCCC2)CC1 |r|
Show InChI InChI=1S/C20H29F3N2O2/c1-24-10-12-25(13-11-24)15-18(19(26)8-3-2-4-9-19)16-6-5-7-17(14-16)27-20(21,22)23/h5-7,14,18,26H,2-4,8-13,15H2,1H3/t18-/m1/s1
Reactome pathway
n/an/a>1.00E+4n/an/an/an/an/an/a
Wyeth Research
Curated by ChEMBL
Assay Description
Inhibition of 5HT2A receptor (unknown origin) by competition radioligand binding assay
J Med Chem 51: 4038-49 (2008)
Article DOI: 10.1021/jm8002262
BindingDB Entry DOI: 10.7270/Q2TB16PB
5-hydroxytryptamine receptor 7
(Homo sapiens (Human))
BDBM50242927
((-)-1-{(1S)-2-(4-Methylpiperazin-1-yl)-1-[3-(trifl...)
Show SMILES CN1CCN(C[C@H](c2cccc(OC(F)(F)F)c2)C2(O)CCCCC2)CC1 |r|
Show InChI InChI=1S/C20H29F3N2O2/c1-24-10-12-25(13-11-24)15-18(19(26)8-3-2-4-9-19)16-6-5-7-17(14-16)27-20(21,22)23/h5-7,14,18,26H,2-4,8-13,15H2,1H3/t18-/m1/s1
Reactome pathway
n/an/an/an/a>1.00E+4n/an/an/an/a
Wyeth Research
Curated by ChEMBL
Assay Description
Activity at 5HT7 receptor (unknown origin) assessed as calcium mobilization by FLIPR
J Med Chem 51: 4038-49 (2008)
Article DOI: 10.1021/jm8002262
BindingDB Entry DOI: 10.7270/Q2TB16PB
5-hydroxytryptamine receptor 6
(Homo sapiens (Human))
BDBM50242927
((-)-1-{(1S)-2-(4-Methylpiperazin-1-yl)-1-[3-(trifl...)
Show SMILES CN1CCN(C[C@H](c2cccc(OC(F)(F)F)c2)C2(O)CCCCC2)CC1 |r|
Show InChI InChI=1S/C20H29F3N2O2/c1-24-10-12-25(13-11-24)15-18(19(26)8-3-2-4-9-19)16-6-5-7-17(14-16)27-20(21,22)23/h5-7,14,18,26H,2-4,8-13,15H2,1H3/t18-/m1/s1
Reactome pathway
n/an/a>1.00E+4n/an/an/an/an/an/a
Wyeth Research
Curated by ChEMBL
Assay Description
Inhibition of 5HT6 receptor (unknown origin) by competition radioligand binding assay
J Med Chem 51: 4038-49 (2008)
Article DOI: 10.1021/jm8002262
BindingDB Entry DOI: 10.7270/Q2TB16PB
5-hydroxytryptamine receptor 7
(Homo sapiens (Human))
BDBM50242927
((-)-1-{(1S)-2-(4-Methylpiperazin-1-yl)-1-[3-(trifl...)
Show SMILES CN1CCN(C[C@H](c2cccc(OC(F)(F)F)c2)C2(O)CCCCC2)CC1 |r|
Show InChI InChI=1S/C20H29F3N2O2/c1-24-10-12-25(13-11-24)15-18(19(26)8-3-2-4-9-19)16-6-5-7-17(14-16)27-20(21,22)23/h5-7,14,18,26H,2-4,8-13,15H2,1H3/t18-/m1/s1
Reactome pathway
n/an/a>1.00E+4n/an/an/an/an/an/a
Wyeth Research
Curated by ChEMBL
Assay Description
Inhibition of 5HT7 receptor (unknown origin) by competition radioligand binding assay
J Med Chem 51: 4038-49 (2008)
Article DOI: 10.1021/jm8002262
BindingDB Entry DOI: 10.7270/Q2TB16PB
5-hydroxytryptamine receptor 1D
(Homo sapiens (Human))
BDBM50242927
((-)-1-{(1S)-2-(4-Methylpiperazin-1-yl)-1-[3-(trifl...)
Show SMILES CN1CCN(C[C@H](c2cccc(OC(F)(F)F)c2)C2(O)CCCCC2)CC1 |r|
Show InChI InChI=1S/C20H29F3N2O2/c1-24-10-12-25(13-11-24)15-18(19(26)8-3-2-4-9-19)16-6-5-7-17(14-16)27-20(21,22)23/h5-7,14,18,26H,2-4,8-13,15H2,1H3/t18-/m1/s1
Reactome pathway
n/an/an/an/a>1.00E+4n/an/an/an/a
Wyeth Research
Curated by ChEMBL
Assay Description
Activity at 5HT1D receptor (unknown origin) assessed as calcium mobilization by FLIPR
J Med Chem 51: 4038-49 (2008)
Article DOI: 10.1021/jm8002262
BindingDB Entry DOI: 10.7270/Q2TB16PB
5-hydroxytryptamine receptor 2A
(Homo sapiens (Human))
BDBM50242927
((-)-1-{(1S)-2-(4-Methylpiperazin-1-yl)-1-[3-(trifl...)
Show SMILES CN1CCN(C[C@H](c2cccc(OC(F)(F)F)c2)C2(O)CCCCC2)CC1 |r|
Show InChI InChI=1S/C20H29F3N2O2/c1-24-10-12-25(13-11-24)15-18(19(26)8-3-2-4-9-19)16-6-5-7-17(14-16)27-20(21,22)23/h5-7,14,18,26H,2-4,8-13,15H2,1H3/t18-/m1/s1
Reactome pathway
n/an/an/an/a>1.00E+4n/an/an/an/a
Wyeth Research
Curated by ChEMBL
Assay Description
Activity at 5HT2A receptor (unknown origin) assessed as calcium mobilization by FLIPR
J Med Chem 51: 4038-49 (2008)
Article DOI: 10.1021/jm8002262
BindingDB Entry DOI: 10.7270/Q2TB16PB
5-hydroxytryptamine receptor 2B
(Homo sapiens (Human))
BDBM50242927
((-)-1-{(1S)-2-(4-Methylpiperazin-1-yl)-1-[3-(trifl...)
Show SMILES CN1CCN(C[C@H](c2cccc(OC(F)(F)F)c2)C2(O)CCCCC2)CC1 |r|
Show InChI InChI=1S/C20H29F3N2O2/c1-24-10-12-25(13-11-24)15-18(19(26)8-3-2-4-9-19)16-6-5-7-17(14-16)27-20(21,22)23/h5-7,14,18,26H,2-4,8-13,15H2,1H3/t18-/m1/s1
Reactome pathway
n/an/an/an/a>1.00E+4n/an/an/an/a
Wyeth Research
Curated by ChEMBL
Assay Description
Activity at 5HT2B receptor (unknown origin) assessed as calcium mobilization by FLIPR
J Med Chem 51: 4038-49 (2008)
Article DOI: 10.1021/jm8002262
BindingDB Entry DOI: 10.7270/Q2TB16PB
5-hydroxytryptamine receptor 6
(Homo sapiens (Human))
BDBM50242927
((-)-1-{(1S)-2-(4-Methylpiperazin-1-yl)-1-[3-(trifl...)
Show SMILES CN1CCN(C[C@H](c2cccc(OC(F)(F)F)c2)C2(O)CCCCC2)CC1 |r|
Show InChI InChI=1S/C20H29F3N2O2/c1-24-10-12-25(13-11-24)15-18(19(26)8-3-2-4-9-19)16-6-5-7-17(14-16)27-20(21,22)23/h5-7,14,18,26H,2-4,8-13,15H2,1H3/t18-/m1/s1
Reactome pathway
n/an/an/an/a>1.00E+4n/an/an/an/a
Wyeth Research
Curated by ChEMBL
Assay Description
Activity at 5HT6 receptor (unknown origin) assessed as calcium mobilization by FLIPR
J Med Chem 51: 4038-49 (2008)
Article DOI: 10.1021/jm8002262
BindingDB Entry DOI: 10.7270/Q2TB16PB
Sodium-dependent noradrenaline transporter
(Homo sapiens (Human))
BDBM50242927
((-)-1-{(1S)-2-(4-Methylpiperazin-1-yl)-1-[3-(trifl...)
Show SMILES CN1CCN(C[C@H](c2cccc(OC(F)(F)F)c2)C2(O)CCCCC2)CC1 |r|
Show InChI InChI=1S/C20H29F3N2O2/c1-24-10-12-25(13-11-24)15-18(19(26)8-3-2-4-9-19)16-6-5-7-17(14-16)27-20(21,22)23/h5-7,14,18,26H,2-4,8-13,15H2,1H3/t18-/m1/s1
Reactome pathway
n/an/a 82n/an/an/an/an/an/a
Wyeth Research
Curated by ChEMBL
Assay Description
Inhibition of norepinephrine uptake at human norepinephrine transporter expressed in MDCK-Net6 cells
J Med Chem 51: 4038-49 (2008)
Article DOI: 10.1021/jm8002262
BindingDB Entry DOI: 10.7270/Q2TB16PB
5-hydroxytryptamine receptor 2B
(Homo sapiens (Human))
BDBM50242927
((-)-1-{(1S)-2-(4-Methylpiperazin-1-yl)-1-[3-(trifl...)
Show SMILES CN1CCN(C[C@H](c2cccc(OC(F)(F)F)c2)C2(O)CCCCC2)CC1 |r|
Show InChI InChI=1S/C20H29F3N2O2/c1-24-10-12-25(13-11-24)15-18(19(26)8-3-2-4-9-19)16-6-5-7-17(14-16)27-20(21,22)23/h5-7,14,18,26H,2-4,8-13,15H2,1H3/t18-/m1/s1
Reactome pathway
n/an/a>1.00E+4n/an/an/an/an/an/a
Wyeth Research
Curated by ChEMBL
Assay Description
Inhibition of 5HT2B receptor (unknown origin) by competition radioligand binding assay
J Med Chem 51: 4038-49 (2008)
Article DOI: 10.1021/jm8002262
BindingDB Entry DOI: 10.7270/Q2TB16PB