BDBM50243012 1-[1-(3-Fluorophenyl)-2-piperazin-1-ylethyl]cyclohexanol Dihydrochloride::CHEMBL470079
SMILES: OC1(CCCCC1)C(CN1CCNCC1)c1cccc(F)c1
InChI Key: InChIKey=PIBZTCVMCNNFRR-UHFFFAOYSA-N
Data: 1 KI  1 IC50
Activity Spreadsheet -- Enzyme Inhibition Constant Data from BindingDB
Found 2 hits for monomerid = 50243012
Trg + Lig
Ki
nM
ΔG°
kcal/mole
IC50
nM
Kd
nM
EC50/IC50
nM
koff
s-1
kon
M-1s-1
pHTemp
°C
Sodium-dependent noradrenaline transporter
(Homo sapiens (Human))
BDBM50243012
(1-[1-(3-Fluorophenyl)-2-piperazin-1-ylethyl]cycloh...)
Show SMILES OC1(CCCCC1)C(CN1CCNCC1)c1cccc(F)c1
Show InChI InChI=1S/C18H27FN2O/c19-16-6-4-5-15(13-16)17(14-21-11-9-20-10-12-21)18(22)7-2-1-3-8-18/h4-6,13,17,20,22H,1-3,7-12,14H2
Reactome pathway
368n/an/an/an/an/an/an/an/a
Wyeth Research
Curated by ChEMBL
Assay Description
Displacement of [3H]nisoxetine from human norepinephrine transporter expressed in MDCK-Net6 cells
J Med Chem 51: 4038-49 (2008)
Article DOI: 10.1021/jm8002262
BindingDB Entry DOI: 10.7270/Q2TB16PB
Sodium-dependent noradrenaline transporter
(Homo sapiens (Human))
BDBM50243012
(1-[1-(3-Fluorophenyl)-2-piperazin-1-ylethyl]cycloh...)
Show SMILES OC1(CCCCC1)C(CN1CCNCC1)c1cccc(F)c1
Show InChI InChI=1S/C18H27FN2O/c19-16-6-4-5-15(13-16)17(14-21-11-9-20-10-12-21)18(22)7-2-1-3-8-18/h4-6,13,17,20,22H,1-3,7-12,14H2
Reactome pathway
n/an/a 673n/an/an/an/an/an/a
Wyeth Research
Curated by ChEMBL
Assay Description
Inhibition of norepinephrine uptake at human norepinephrine transporter expressed in MDCK-Net6 cells
J Med Chem 51: 4038-49 (2008)
Article DOI: 10.1021/jm8002262
BindingDB Entry DOI: 10.7270/Q2TB16PB