BDBM50243049 (S)-1-(5-(4-cyanophenyl)-3-(piperidin-3-ylcarbamoyl)thiophen-2-yl)urea::CHEMBL2070713::CHEMBL469481
SMILES: NC(=O)Nc1sc(cc1C(=O)N[C@H]1CCCNC1)-c1ccc(cc1)C#N
InChI Key: InChIKey=MNFQKQFALPLTFJ-ZDUSSCGKSA-N
Data: 3 IC50  2 EC50
Activity Spreadsheet -- Enzyme Inhibition Constant Data from BindingDB
Found 5 hits for monomerid = 50243049
Trg + Lig
Ki
nM
ΔG°
kcal/mole
IC50
nM
Kd
nM
EC50/IC50
nM
koff
s-1
kon
M-1s-1
pHTemp
°C
Serine/threonine-protein kinase Chk1
(Homo sapiens (Human))
BDBM50243049
((S)-1-(5-(4-cyanophenyl)-3-(piperidin-3-ylcarbamoy...)
Show SMILES NC(=O)Nc1sc(cc1C(=O)N[C@H]1CCCNC1)-c1ccc(cc1)C#N |r|
Show InChI InChI=1S/C18H19N5O2S/c19-9-11-3-5-12(6-4-11)15-8-14(17(26-15)23-18(20)25)16(24)22-13-2-1-7-21-10-13/h3-6,8,13,21H,1-2,7,10H2,(H,22,24)(H3,20,23,25)/t13-/m0/s1
Reactome pathway
n/an/a 6n/an/an/an/an/an/a
AstraZeneca
Curated by ChEMBL
Assay Description
Inhibition of human recombinant CHK1 expressed in insect cells using biotinylaminohexanoyl-KKVSRSGLYRSPMPENLNRPR as substrate after 2 hrs by scintill...
J Med Chem 55: 5130-42 (2012)
Article DOI: 10.1021/jm300025r
BindingDB Entry DOI: 10.7270/Q2RV0PR6
3D
3D Structure (docked)
Serine/threonine-protein kinase Chk1
(Homo sapiens (Human))
BDBM50243049
((S)-1-(5-(4-cyanophenyl)-3-(piperidin-3-ylcarbamoy...)
Show SMILES NC(=O)Nc1sc(cc1C(=O)N[C@H]1CCCNC1)-c1ccc(cc1)C#N |r|
Show InChI InChI=1S/C18H19N5O2S/c19-9-11-3-5-12(6-4-11)15-8-14(17(26-15)23-18(20)25)16(24)22-13-2-1-7-21-10-13/h3-6,8,13,21H,1-2,7,10H2,(H,22,24)(H3,20,23,25)/t13-/m0/s1
Reactome pathway
n/an/an/an/a 8n/an/an/an/a
AstraZeneca
Curated by ChEMBL
Assay Description
Inhibition of CHK1 in human HT29 cells assessed as abrogation of campothecin induced check point
J Med Chem 55: 5130-42 (2012)
Article DOI: 10.1021/jm300025r
BindingDB Entry DOI: 10.7270/Q2RV0PR6
3D
3D Structure (docked)
Cyclin-dependent kinase 2-associated protein 1
(Homo sapiens (Human))
BDBM50243049
((S)-1-(5-(4-cyanophenyl)-3-(piperidin-3-ylcarbamoy...)
Show SMILES NC(=O)Nc1sc(cc1C(=O)N[C@H]1CCCNC1)-c1ccc(cc1)C#N |r|
Show InChI InChI=1S/C18H19N5O2S/c19-9-11-3-5-12(6-4-11)15-8-14(17(26-15)23-18(20)25)16(24)22-13-2-1-7-21-10-13/h3-6,8,13,21H,1-2,7,10H2,(H,22,24)(H3,20,23,25)/t13-/m0/s1
n/an/a 3.60E+3n/an/an/an/an/an/a
AstraZeneca R&D Boston
Curated by ChEMBL
Assay Description
Inhibition of Cdk1
Bioorg Med Chem Lett 18: 4242-8 (2008)
Article DOI: 10.1016/j.bmcl.2008.05.016
BindingDB Entry DOI: 10.7270/Q2J102Z9
Serine/threonine-protein kinase Chk1
(Homo sapiens (Human))
BDBM50243049
((S)-1-(5-(4-cyanophenyl)-3-(piperidin-3-ylcarbamoy...)
Show SMILES NC(=O)Nc1sc(cc1C(=O)N[C@H]1CCCNC1)-c1ccc(cc1)C#N |r|
Show InChI InChI=1S/C18H19N5O2S/c19-9-11-3-5-12(6-4-11)15-8-14(17(26-15)23-18(20)25)16(24)22-13-2-1-7-21-10-13/h3-6,8,13,21H,1-2,7,10H2,(H,22,24)(H3,20,23,25)/t13-/m0/s1
Reactome pathway
n/an/a 6n/an/an/an/an/an/a
AstraZeneca R&D Boston
Curated by ChEMBL
Assay Description
Inhibition of Chk1
Bioorg Med Chem Lett 18: 4242-8 (2008)
Article DOI: 10.1016/j.bmcl.2008.05.016
BindingDB Entry DOI: 10.7270/Q2J102Z9
3D
3D Structure (docked)
Serine/threonine-protein kinase Chk1
(Homo sapiens (Human))
BDBM50243049
((S)-1-(5-(4-cyanophenyl)-3-(piperidin-3-ylcarbamoy...)
Show SMILES NC(=O)Nc1sc(cc1C(=O)N[C@H]1CCCNC1)-c1ccc(cc1)C#N |r|
Show InChI InChI=1S/C18H19N5O2S/c19-9-11-3-5-12(6-4-11)15-8-14(17(26-15)23-18(20)25)16(24)22-13-2-1-7-21-10-13/h3-6,8,13,21H,1-2,7,10H2,(H,22,24)(H3,20,23,25)/t13-/m0/s1
Reactome pathway
n/an/an/an/a 1.70E+3n/an/an/an/a
AstraZeneca
Curated by ChEMBL
Assay Description
Inhibition of CHK1 in human HT29 cells assessed as check point abrogation
J Med Chem 55: 5130-42 (2012)
Article DOI: 10.1021/jm300025r
BindingDB Entry DOI: 10.7270/Q2RV0PR6
3D
3D Structure (docked)