BDBM50243301 CHEMBL454085::Tetrahydrofuran-2-ylmethyl 4-{[(2-benzoylphenyl)amino]sulfonyl}phenylcarbamate
SMILES: O=C(Nc1ccc(cc1)S(=O)(=O)Nc1ccccc1C(=O)c1ccccc1)OCC1CCCO1
InChI Key: InChIKey=KEPWZYCHQXYTEN-UHFFFAOYSA-N
Data: 2 KI  1 IC50
Activity Spreadsheet -- Enzyme Inhibition Constant Data from BindingDB
Found 3 hits for monomerid = 50243301
Trg + Lig
Ki
nM
ΔG°
kcal/mole
IC50
nM
Kd
nM
EC50/IC50
nM
koff
s-1
kon
M-1s-1
pHTemp
°C
Bradykinin B1 receptor
(Homo sapiens (Human))
BDBM50243301
(CHEMBL454085 | Tetrahydrofuran-2-ylmethyl 4-{[(2-b...)
Show SMILES O=C(Nc1ccc(cc1)S(=O)(=O)Nc1ccccc1C(=O)c1ccccc1)OCC1CCCO1
Show InChI InChI=1S/C25H24N2O6S/c28-24(18-7-2-1-3-8-18)22-10-4-5-11-23(22)27-34(30,31)21-14-12-19(13-15-21)26-25(29)33-17-20-9-6-16-32-20/h1-5,7-8,10-15,20,27H,6,9,16-17H2,(H,26,29)
0.700n/an/an/an/an/an/an/an/a
Johnson& Johnson Pharmaceutical Research and Development
Curated by ChEMBL
Assay Description
Displacement of [3H]Lys0-des-Arg9-BK at human bradykinin B1 receptor expressed in HEK293 cells
J Med Chem 53: 5383-99 (2010)
Article DOI: 10.1021/jm1000776
BindingDB Entry DOI: 10.7270/Q289162Z
Bradykinin B1 receptor
(Homo sapiens (Human))
BDBM50243301
(CHEMBL454085 | Tetrahydrofuran-2-ylmethyl 4-{[(2-b...)
Show SMILES O=C(Nc1ccc(cc1)S(=O)(=O)Nc1ccccc1C(=O)c1ccccc1)OCC1CCCO1
Show InChI InChI=1S/C25H24N2O6S/c28-24(18-7-2-1-3-8-18)22-10-4-5-11-23(22)27-34(30,31)21-14-12-19(13-15-21)26-25(29)33-17-20-9-6-16-32-20/h1-5,7-8,10-15,20,27H,6,9,16-17H2,(H,26,29)
0.700n/an/an/an/an/an/an/an/a
Merck Research Laboratories
Curated by ChEMBL
Assay Description
Binding affinity to human bradykinin B1 receptor
J Med Chem 51: 3946-52 (2008)
Article DOI: 10.1021/jm800199h
BindingDB Entry DOI: 10.7270/Q2JH3N33
Potassium voltage-gated channel subfamily H member 2
(Homo sapiens (Human))
BDBM50243301
(CHEMBL454085 | Tetrahydrofuran-2-ylmethyl 4-{[(2-b...)
Show SMILES O=C(Nc1ccc(cc1)S(=O)(=O)Nc1ccccc1C(=O)c1ccccc1)OCC1CCCO1
Show InChI InChI=1S/C25H24N2O6S/c28-24(18-7-2-1-3-8-18)22-10-4-5-11-23(22)27-34(30,31)21-14-12-19(13-15-21)26-25(29)33-17-20-9-6-16-32-20/h1-5,7-8,10-15,20,27H,6,9,16-17H2,(H,26,29)
Reactome pathway
n/an/a 8.20E+3n/an/an/an/an/an/a
Merck Research Laboratories
Curated by ChEMBL
Assay Description
Displacement of MK-499 from human ERG channel in HEK293 cells
J Med Chem 51: 3946-52 (2008)
Article DOI: 10.1021/jm800199h
BindingDB Entry DOI: 10.7270/Q2JH3N33